BDBM50364912 CHEMBL1950176
SMILES: CCOC(=O)C(CCCC(O)=O)=NNc1ccc(C)cc1
InChI Key: InChIKey=BCJXRHSQFGELMD-UHFFFAOYSA-N
Data: 1 IC50
Activity Spreadsheet -- Enzyme Inhibition Constant Data from BindingDB
Found 1 hit for monomerid = 50364912
Trg + Lig
Ki
nM
ΔG°
kcal/mole
IC50
nM
Kd
nM
EC50/IC50
nM
koff
s-1
kon
M-1s-1
pHTemp
°C
Kynurenine Aminotransferase 1/Glutamine Transaminase K
(Homo sapiens (Human))
BDBM50364912
(CHEMBL1950176)
Show SMILES CCOC(=O)C(CCCC(O)=O)=NNc1ccc(C)cc1 |w:12.12|
Show InChI InChI=1S/C15H20N2O4/c1-3-21-15(20)13(5-4-6-14(18)19)17-16-12-9-7-11(2)8-10-12/h7-10,16H,3-6H2,1-2H3,(H,18,19)
Reactome pathway
n/an/a 3.30E+4n/an/an/an/an/an/a
The University of Sydney
Curated by ChEMBL
Assay Description
Inhibition of human recombinant KAT1 after 20 mins by RP-HPLC analysis
Bioorg Med Chem Lett 22: 1579-81 (2012)
Article DOI: 10.1016/j.bmcl.2011.12.138
BindingDB Entry DOI: 10.7270/Q2891693