BDBM50364921 CHEMBL1950329
SMILES: CCOc1ccc(Cc2nc3cc(ccc3n2CC2CCCCC2)N(C)S(=O)(=O)c2cccs2)nc1
InChI Key: InChIKey=YIEVWZCZMDYKQH-UHFFFAOYSA-N
Data: 2 KI  1 EC50
Activity Spreadsheet -- Enzyme Inhibition Constant Data from BindingDB
Found 3 hits for monomerid = 50364921
Trg + Lig
Ki
nM
ΔG°
kcal/mole
IC50
nM
Kd
nM
EC50/IC50
nM
koff
s-1
kon
M-1s-1
pHTemp
°C
Cannabinoid receptor 2
(Homo sapiens (Human))
BDBM50364921
(CHEMBL1950329)
Show SMILES CCOc1ccc(Cc2nc3cc(ccc3n2CC2CCCCC2)N(C)S(=O)(=O)c2cccs2)nc1
Show InChI InChI=1S/C27H32N4O3S2/c1-3-34-23-13-11-21(28-18-23)16-26-29-24-17-22(30(2)36(32,33)27-10-7-15-35-27)12-14-25(24)31(26)19-20-8-5-4-6-9-20/h7,10-15,17-18,20H,3-6,8-9,16,19H2,1-2H3
Reactome pathway
0.560n/an/an/an/an/an/an/an/a
AstraZeneca R&D Montreal
Curated by ChEMBL
Assay Description
Binding affinity to human CB2 receptor
Bioorg Med Chem Lett 22: 1619-24 (2012)
Article DOI: 10.1016/j.bmcl.2011.12.124
BindingDB Entry DOI: 10.7270/Q24J0FJX
Cannabinoid receptor 1
(Homo sapiens (Human))
BDBM50364921
(CHEMBL1950329)
Show SMILES CCOc1ccc(Cc2nc3cc(ccc3n2CC2CCCCC2)N(C)S(=O)(=O)c2cccs2)nc1
Show InChI InChI=1S/C27H32N4O3S2/c1-3-34-23-13-11-21(28-18-23)16-26-29-24-17-22(30(2)36(32,33)27-10-7-15-35-27)12-14-25(24)31(26)19-20-8-5-4-6-9-20/h7,10-15,17-18,20H,3-6,8-9,16,19H2,1-2H3
NCI pathway
Reactome pathway
3n/an/an/an/an/an/an/an/a
AstraZeneca R&D Montreal
Curated by ChEMBL
Assay Description
Displacement of [3H]-CP55,940 from human CB1 receptor expressed in HEK293 cells
Bioorg Med Chem Lett 22: 1619-24 (2012)
Article DOI: 10.1016/j.bmcl.2011.12.124
BindingDB Entry DOI: 10.7270/Q24J0FJX
Cannabinoid receptor 1
(Homo sapiens (Human))
BDBM50364921
(CHEMBL1950329)
Show SMILES CCOc1ccc(Cc2nc3cc(ccc3n2CC2CCCCC2)N(C)S(=O)(=O)c2cccs2)nc1
Show InChI InChI=1S/C27H32N4O3S2/c1-3-34-23-13-11-21(28-18-23)16-26-29-24-17-22(30(2)36(32,33)27-10-7-15-35-27)12-14-25(24)31(26)19-20-8-5-4-6-9-20/h7,10-15,17-18,20H,3-6,8-9,16,19H2,1-2H3
NCI pathway
Reactome pathway
n/an/an/an/a 6n/an/an/an/a
AstraZeneca R&D Montreal
Curated by ChEMBL
Assay Description
Agonist activity at human CB1 receptor expressed in HEK293 EBNA cells by [35S]GTPgamma binding assay
Bioorg Med Chem Lett 22: 1619-24 (2012)
Article DOI: 10.1016/j.bmcl.2011.12.124
BindingDB Entry DOI: 10.7270/Q24J0FJX