BDBM50365121 CHEMBL1952405
SMILES: CCOC(=O)C(=O)N(Cc1cccc(F)c1)c1ccc2N(C)CC(C)(COc3ccc(cc3)C(N)=N)Oc2c1
InChI Key: InChIKey=SAVUGAHTVNEDQX-UHFFFAOYSA-N
Data: 2 KI  2 IC50
Activity Spreadsheet -- Enzyme Inhibition Constant Data from BindingDB
Found 4 hits for monomerid = 50365121
Trg + Lig
Ki
nM
ΔG°
kcal/mole
IC50
nM
Kd
nM
EC50/IC50
nM
koff
s-1
kon
M-1s-1
pHTemp
°C
Prothrombin
(Homo sapiens (Human))
BDBM50365121
(CHEMBL1952405)
Show SMILES CCOC(=O)C(=O)N(Cc1cccc(F)c1)c1ccc2N(C)CC(C)(COc3ccc(cc3)C(N)=N)Oc2c1
Show InChI InChI=1S/C29H31FN4O5/c1-4-37-28(36)27(35)34(16-19-6-5-7-21(30)14-19)22-10-13-24-25(15-22)39-29(2,17-33(24)3)18-38-23-11-8-20(9-12-23)26(31)32/h5-15H,4,16-18H2,1-3H3,(H3,31,32)
19n/an/an/an/an/an/an/an/a
University of Ljubljana
Curated by ChEMBL
Assay Description
Inhibition of thrombin using S-2238 as substrate preincubated for 15 mins prior substrate addition measured for every 10 secs by spectrophotometry
Eur J Med Chem 50: 255-63 (2012)
Article DOI: 10.1016/j.ejmech.2012.01.059
BindingDB Entry DOI: 10.7270/Q2KK9C7V
Coagulation factor X
(Homo sapiens (Human))
BDBM50365121
(CHEMBL1952405)
Show SMILES CCOC(=O)C(=O)N(Cc1cccc(F)c1)c1ccc2N(C)CC(C)(COc3ccc(cc3)C(N)=N)Oc2c1
Show InChI InChI=1S/C29H31FN4O5/c1-4-37-28(36)27(35)34(16-19-6-5-7-21(30)14-19)22-10-13-24-25(15-22)39-29(2,17-33(24)3)18-38-23-11-8-20(9-12-23)26(31)32/h5-15H,4,16-18H2,1-3H3,(H3,31,32)
Reactome pathway
1.60E+3n/an/an/an/an/an/an/an/a
University of Ljubljana
Curated by ChEMBL
Assay Description
Inhibition of factor 10a using S-2222 as substrate preincubated for 15 mins prior substrate addition measured for every 10 secs by spectrophotometry
Eur J Med Chem 50: 255-63 (2012)
Article DOI: 10.1016/j.ejmech.2012.01.059
BindingDB Entry DOI: 10.7270/Q2KK9C7V
ITGAV/ITGB3
(Homo sapiens (Human))
BDBM50365121
(CHEMBL1952405)
Show SMILES CCOC(=O)C(=O)N(Cc1cccc(F)c1)c1ccc2N(C)CC(C)(COc3ccc(cc3)C(N)=N)Oc2c1
Show InChI InChI=1S/C29H31FN4O5/c1-4-37-28(36)27(35)34(16-19-6-5-7-21(30)14-19)22-10-13-24-25(15-22)39-29(2,17-33(24)3)18-38-23-11-8-20(9-12-23)26(31)32/h5-15H,4,16-18H2,1-3H3,(H3,31,32)
n/an/a>1.00E+5n/an/an/an/an/an/a
University of Ljubljana
Curated by ChEMBL
Assay Description
Displacement of biotinylated fibrinogen from human alpha5-beta3 receptor after 2 hrs by chemiluminescence assay
Eur J Med Chem 50: 255-63 (2012)
Article DOI: 10.1016/j.ejmech.2012.01.059
BindingDB Entry DOI: 10.7270/Q2KK9C7V
Integrin alpha-IIb/beta-3
(Homo sapiens (Human))
BDBM50365121
(CHEMBL1952405)
Show SMILES CCOC(=O)C(=O)N(Cc1cccc(F)c1)c1ccc2N(C)CC(C)(COc3ccc(cc3)C(N)=N)Oc2c1
Show InChI InChI=1S/C29H31FN4O5/c1-4-37-28(36)27(35)34(16-19-6-5-7-21(30)14-19)22-10-13-24-25(15-22)39-29(2,17-33(24)3)18-38-23-11-8-20(9-12-23)26(31)32/h5-15H,4,16-18H2,1-3H3,(H3,31,32)
n/an/a>1.00E+5n/an/an/an/an/an/a
University of Ljubljana
Curated by ChEMBL
Assay Description
Displacement of biotinylated fibrinogen from human alpha2b-beta3 receptor after 2 hrs by chemiluminescence assay
Eur J Med Chem 50: 255-63 (2012)
Article DOI: 10.1016/j.ejmech.2012.01.059
BindingDB Entry DOI: 10.7270/Q2KK9C7V