BDBM50365133 CHEMBL1952398
SMILES: CN1CC(C)(COc2ccc(cc2)C(N)=N)Oc2ccc(cc12)N(CC(O)=O)Cc1ccc(F)cc1
InChI Key: InChIKey=BKOMQTOAFLZQBE-UHFFFAOYSA-N
Data: 2 KI  2 IC50
Activity Spreadsheet -- Enzyme Inhibition Constant Data from BindingDB
Found 4 hits for monomerid = 50365133
Trg + Lig
Ki
nM
ΔG°
kcal/mole
IC50
nM
Kd
nM
EC50/IC50
nM
koff
s-1
kon
M-1s-1
pHTemp
°C
Prothrombin
(Homo sapiens (Human))
BDBM50365133
(CHEMBL1952398)
Show SMILES CN1CC(C)(COc2ccc(cc2)C(N)=N)Oc2ccc(cc12)N(CC(O)=O)Cc1ccc(F)cc1
Show InChI InChI=1S/C27H29FN4O4/c1-27(17-35-22-10-5-19(6-11-22)26(29)30)16-31(2)23-13-21(9-12-24(23)36-27)32(15-25(33)34)14-18-3-7-20(28)8-4-18/h3-13H,14-17H2,1-2H3,(H3,29,30)(H,33,34)
750n/an/an/an/an/an/an/an/a
University of Ljubljana
Curated by ChEMBL
Assay Description
Inhibition of thrombin using S-2238 as substrate preincubated for 15 mins prior substrate addition measured for every 10 secs by spectrophotometry
Eur J Med Chem 50: 255-63 (2012)
Article DOI: 10.1016/j.ejmech.2012.01.059
BindingDB Entry DOI: 10.7270/Q2KK9C7V
Coagulation factor X
(Homo sapiens (Human))
BDBM50365133
(CHEMBL1952398)
Show SMILES CN1CC(C)(COc2ccc(cc2)C(N)=N)Oc2ccc(cc12)N(CC(O)=O)Cc1ccc(F)cc1
Show InChI InChI=1S/C27H29FN4O4/c1-27(17-35-22-10-5-19(6-11-22)26(29)30)16-31(2)23-13-21(9-12-24(23)36-27)32(15-25(33)34)14-18-3-7-20(28)8-4-18/h3-13H,14-17H2,1-2H3,(H3,29,30)(H,33,34)
Reactome pathway
7.70E+3n/an/an/an/an/an/an/an/a
University of Ljubljana
Curated by ChEMBL
Assay Description
Inhibition of factor 10a using S-2222 as substrate preincubated for 15 mins prior substrate addition measured for every 10 secs by spectrophotometry
Eur J Med Chem 50: 255-63 (2012)
Article DOI: 10.1016/j.ejmech.2012.01.059
BindingDB Entry DOI: 10.7270/Q2KK9C7V
ITGAV/ITGB3
(Homo sapiens (Human))
BDBM50365133
(CHEMBL1952398)
Show SMILES CN1CC(C)(COc2ccc(cc2)C(N)=N)Oc2ccc(cc12)N(CC(O)=O)Cc1ccc(F)cc1
Show InChI InChI=1S/C27H29FN4O4/c1-27(17-35-22-10-5-19(6-11-22)26(29)30)16-31(2)23-13-21(9-12-24(23)36-27)32(15-25(33)34)14-18-3-7-20(28)8-4-18/h3-13H,14-17H2,1-2H3,(H3,29,30)(H,33,34)
n/an/a>1.00E+5n/an/an/an/an/an/a
University of Ljubljana
Curated by ChEMBL
Assay Description
Displacement of biotinylated fibrinogen from human alpha5-beta3 receptor after 2 hrs by chemiluminescence assay
Eur J Med Chem 50: 255-63 (2012)
Article DOI: 10.1016/j.ejmech.2012.01.059
BindingDB Entry DOI: 10.7270/Q2KK9C7V
Integrin alpha-IIb/beta-3
(Homo sapiens (Human))
BDBM50365133
(CHEMBL1952398)
Show SMILES CN1CC(C)(COc2ccc(cc2)C(N)=N)Oc2ccc(cc12)N(CC(O)=O)Cc1ccc(F)cc1
Show InChI InChI=1S/C27H29FN4O4/c1-27(17-35-22-10-5-19(6-11-22)26(29)30)16-31(2)23-13-21(9-12-24(23)36-27)32(15-25(33)34)14-18-3-7-20(28)8-4-18/h3-13H,14-17H2,1-2H3,(H3,29,30)(H,33,34)
n/an/a 2.00E+3n/an/an/an/an/an/a
University of Ljubljana
Curated by ChEMBL
Assay Description
Displacement of biotinylated fibrinogen from human alpha2b-beta3 receptor after 2 hrs by chemiluminescence assay
Eur J Med Chem 50: 255-63 (2012)
Article DOI: 10.1016/j.ejmech.2012.01.059
BindingDB Entry DOI: 10.7270/Q2KK9C7V