BDBM50365267 CHEMBL1958349
SMILES: CC(C)Cc1ccc(cc1)C(C)C(=O)Oc1ccc(CCO)cc1
InChI Key: InChIKey=YNCFJJJQCGMSHY-UHFFFAOYSA-N
Data: 2 IC50
Activity Spreadsheet -- Enzyme Inhibition Constant Data from BindingDB
Found 2 hits for monomerid = 50365267
Trg + Lig
Ki
nM
ΔG°
kcal/mole
IC50
nM
Kd
nM
EC50/IC50
nM
koff
s-1
kon
M-1s-1
pHTemp
°C
Prostaglandin G/H synthase 2
(Homo sapiens (Human))
BDBM50365267
(CHEMBL1958349)
Show SMILES CC(C)Cc1ccc(cc1)C(C)C(=O)Oc1ccc(CCO)cc1
Show InChI InChI=1S/C21H26O3/c1-15(2)14-18-4-8-19(9-5-18)16(3)21(23)24-20-10-6-17(7-11-20)12-13-22/h4-11,15-16,22H,12-14H2,1-3H3
NCI pathway
Reactome pathway
n/an/a 0.200n/an/an/an/an/an/a
University of Alberta
Curated by ChEMBL
Assay Description
Inhibition of human recombinant COX2
J Med Chem 55: 688-96 (2012)
Article DOI: 10.1021/jm200973j
BindingDB Entry DOI: 10.7270/Q2HM58Z7
Prostaglandin G/H synthase 1
(Ovis aries (Sheep))
BDBM50365267
(CHEMBL1958349)
Show SMILES CC(C)Cc1ccc(cc1)C(C)C(=O)Oc1ccc(CCO)cc1
Show InChI InChI=1S/C21H26O3/c1-15(2)14-18-4-8-19(9-5-18)16(3)21(23)24-20-10-6-17(7-11-20)12-13-22/h4-11,15-16,22H,12-14H2,1-3H3
n/an/a 6.44E+3n/an/an/an/an/an/a
University of Alberta
Curated by ChEMBL
Assay Description
Inhibition of ovine COX1
J Med Chem 55: 688-96 (2012)
Article DOI: 10.1021/jm200973j
BindingDB Entry DOI: 10.7270/Q2HM58Z7