BDBM50365300 CHEMBL1955906
SMILES: CCCn1c2nc([nH]c2c(=O)n(CCC)c1=O)-c1cc(OCc2nc3c(C)cccc3[nH]2)nn1C
InChI Key: InChIKey=RHKYMFDJXMOSJT-UHFFFAOYSA-N
Data: 4 KI  1 IC50
Activity Spreadsheet -- Enzyme Inhibition Constant Data from BindingDB
Found 5 hits for monomerid = 50365300
Trg + Lig
Ki
nM
ΔG°
kcal/mole
IC50
nM
Kd
nM
EC50/IC50
nM
koff
s-1
kon
M-1s-1
pHTemp
°C
Adenosine receptor A2b
(Homo sapiens (Human))
BDBM50365300
(CHEMBL1955906)
Show SMILES CCCn1c2nc([nH]c2c(=O)n(CCC)c1=O)-c1cc(OCc2nc3c(C)cccc3[nH]2)nn1C
Show InChI InChI=1S/C24H28N8O3/c1-5-10-31-22-20(23(33)32(11-6-2)24(31)34)27-21(28-22)16-12-18(29-30(16)4)35-13-17-25-15-9-7-8-14(3)19(15)26-17/h7-9,12H,5-6,10-11,13H2,1-4H3,(H,25,26)(H,27,28)
NCI pathway
Reactome pathway
14.1n/an/an/an/an/an/an/an/a
University of Ferrara
Curated by ChEMBL
Assay Description
Displacement of [3H]MRE2029-F20 from human recombinant adenosine A2B receptor expressed in HEK293 cells after 120 mins by scintillation counting
J Med Chem 55: 797-811 (2012)
Article DOI: 10.1021/jm201292w
BindingDB Entry DOI: 10.7270/Q2862GXT
Adenosine receptor A1
(Homo sapiens (Human))
BDBM50365300
(CHEMBL1955906)
Show SMILES CCCn1c2nc([nH]c2c(=O)n(CCC)c1=O)-c1cc(OCc2nc3c(C)cccc3[nH]2)nn1C
Show InChI InChI=1S/C24H28N8O3/c1-5-10-31-22-20(23(33)32(11-6-2)24(31)34)27-21(28-22)16-12-18(29-30(16)4)35-13-17-25-15-9-7-8-14(3)19(15)26-17/h7-9,12H,5-6,10-11,13H2,1-4H3,(H,25,26)(H,27,28)
Reactome pathway
685n/an/an/an/an/an/an/an/a
University of Ferrara
Curated by ChEMBL
Assay Description
Displacement of [3H]DPCPX from human recombinant adenosine A1 receptor expressed in CHO cells after 120 mins by scintillation counting
J Med Chem 55: 797-811 (2012)
Article DOI: 10.1021/jm201292w
BindingDB Entry DOI: 10.7270/Q2862GXT
Adenosine receptor A3
(Homo sapiens (Human))
BDBM50365300
(CHEMBL1955906)
Show SMILES CCCn1c2nc([nH]c2c(=O)n(CCC)c1=O)-c1cc(OCc2nc3c(C)cccc3[nH]2)nn1C
Show InChI InChI=1S/C24H28N8O3/c1-5-10-31-22-20(23(33)32(11-6-2)24(31)34)27-21(28-22)16-12-18(29-30(16)4)35-13-17-25-15-9-7-8-14(3)19(15)26-17/h7-9,12H,5-6,10-11,13H2,1-4H3,(H,25,26)(H,27,28)
Reactome pathway
>1.00E+3n/an/an/an/an/an/an/an/a
University of Ferrara
Curated by ChEMBL
Assay Description
Displacement of [3H]MRE3008-F20 from human recombinant adenosine A3 receptor expressed in CHO cells after 120 mins by scintillation counting
J Med Chem 55: 797-811 (2012)
Article DOI: 10.1021/jm201292w
BindingDB Entry DOI: 10.7270/Q2862GXT
Adenosine receptor A2a
(Homo sapiens (Human))
BDBM50365300
(CHEMBL1955906)
Show SMILES CCCn1c2nc([nH]c2c(=O)n(CCC)c1=O)-c1cc(OCc2nc3c(C)cccc3[nH]2)nn1C
Show InChI InChI=1S/C24H28N8O3/c1-5-10-31-22-20(23(33)32(11-6-2)24(31)34)27-21(28-22)16-12-18(29-30(16)4)35-13-17-25-15-9-7-8-14(3)19(15)26-17/h7-9,12H,5-6,10-11,13H2,1-4H3,(H,25,26)(H,27,28)
NCI pathway
Reactome pathway
>1.00E+3n/an/an/an/an/an/an/an/a
University of Ferrara
Curated by ChEMBL
Assay Description
Displacement of [3H]ZM241385 from human recombinant adenosine A2A receptor expressed in CHO cells after 120 mins by scintillation counting
J Med Chem 55: 797-811 (2012)
Article DOI: 10.1021/jm201292w
BindingDB Entry DOI: 10.7270/Q2862GXT
Adenosine receptor A2b
(Homo sapiens (Human))
BDBM50365300
(CHEMBL1955906)
Show SMILES CCCn1c2nc([nH]c2c(=O)n(CCC)c1=O)-c1cc(OCc2nc3c(C)cccc3[nH]2)nn1C
Show InChI InChI=1S/C24H28N8O3/c1-5-10-31-22-20(23(33)32(11-6-2)24(31)34)27-21(28-22)16-12-18(29-30(16)4)35-13-17-25-15-9-7-8-14(3)19(15)26-17/h7-9,12H,5-6,10-11,13H2,1-4H3,(H,25,26)(H,27,28)
NCI pathway
Reactome pathway
n/an/a 60n/an/an/an/an/an/a
University of Ferrara
Curated by ChEMBL
Assay Description
Antagonist activity at human recombinant adenosine A2B receptor expressed in CHO cells assessed as inhibition of NECA-induced [3H]cAMP production aft...
J Med Chem 55: 797-811 (2012)
Article DOI: 10.1021/jm201292w
BindingDB Entry DOI: 10.7270/Q2862GXT