BDBM50365319 CHEMBL1955925
SMILES: CCCn1c2cc([nH]c2c(=O)n(CCC)c1=O)-c1cc(OCC(=O)Nc2ccc(F)cc2)nn1C
InChI Key: InChIKey=NZLUWVFBFQTKLH-UHFFFAOYSA-N
Data: 4 KI  1 IC50
Activity Spreadsheet -- Enzyme Inhibition Constant Data from BindingDB
Found 5 hits for monomerid = 50365319
Trg + Lig
Ki
nM
ΔG°
kcal/mole
IC50
nM
Kd
nM
EC50/IC50
nM
koff
s-1
kon
M-1s-1
pHTemp
°C
Adenosine receptor A2b
(Homo sapiens (Human))
BDBM50365319
(CHEMBL1955925)
Show SMILES CCCn1c2cc([nH]c2c(=O)n(CCC)c1=O)-c1cc(OCC(=O)Nc2ccc(F)cc2)nn1C
Show InChI InChI=1S/C24H27FN6O4/c1-4-10-30-19-12-17(27-22(19)23(33)31(11-5-2)24(30)34)18-13-21(28-29(18)3)35-14-20(32)26-16-8-6-15(25)7-9-16/h6-9,12-13,27H,4-5,10-11,14H2,1-3H3,(H,26,32)
NCI pathway
Reactome pathway
13.4n/an/an/an/an/an/an/an/a
University of Ferrara
Curated by ChEMBL
Assay Description
Displacement of [3H]MRE2029-F20 from human recombinant adenosine A2B receptor expressed in HEK293 cells after 120 mins by scintillation counting
J Med Chem 55: 797-811 (2012)
Article DOI: 10.1021/jm201292w
BindingDB Entry DOI: 10.7270/Q2862GXT
Adenosine receptor A1
(Homo sapiens (Human))
BDBM50365319
(CHEMBL1955925)
Show SMILES CCCn1c2cc([nH]c2c(=O)n(CCC)c1=O)-c1cc(OCC(=O)Nc2ccc(F)cc2)nn1C
Show InChI InChI=1S/C24H27FN6O4/c1-4-10-30-19-12-17(27-22(19)23(33)31(11-5-2)24(30)34)18-13-21(28-29(18)3)35-14-20(32)26-16-8-6-15(25)7-9-16/h6-9,12-13,27H,4-5,10-11,14H2,1-3H3,(H,26,32)
Reactome pathway
45n/an/an/an/an/an/an/an/a
University of Ferrara
Curated by ChEMBL
Assay Description
Displacement of [3H]DPCPX from human recombinant adenosine A1 receptor expressed in CHO cells after 120 mins by scintillation counting
J Med Chem 55: 797-811 (2012)
Article DOI: 10.1021/jm201292w
BindingDB Entry DOI: 10.7270/Q2862GXT
Adenosine receptor A3
(Homo sapiens (Human))
BDBM50365319
(CHEMBL1955925)
Show SMILES CCCn1c2cc([nH]c2c(=O)n(CCC)c1=O)-c1cc(OCC(=O)Nc2ccc(F)cc2)nn1C
Show InChI InChI=1S/C24H27FN6O4/c1-4-10-30-19-12-17(27-22(19)23(33)31(11-5-2)24(30)34)18-13-21(28-29(18)3)35-14-20(32)26-16-8-6-15(25)7-9-16/h6-9,12-13,27H,4-5,10-11,14H2,1-3H3,(H,26,32)
Reactome pathway
>1.00E+3n/an/an/an/an/an/an/an/a
University of Ferrara
Curated by ChEMBL
Assay Description
Displacement of [3H]MRE3008-F20 from human recombinant adenosine A3 receptor expressed in CHO cells after 120 mins by scintillation counting
J Med Chem 55: 797-811 (2012)
Article DOI: 10.1021/jm201292w
BindingDB Entry DOI: 10.7270/Q2862GXT
Adenosine receptor A2a
(Homo sapiens (Human))
BDBM50365319
(CHEMBL1955925)
Show SMILES CCCn1c2cc([nH]c2c(=O)n(CCC)c1=O)-c1cc(OCC(=O)Nc2ccc(F)cc2)nn1C
Show InChI InChI=1S/C24H27FN6O4/c1-4-10-30-19-12-17(27-22(19)23(33)31(11-5-2)24(30)34)18-13-21(28-29(18)3)35-14-20(32)26-16-8-6-15(25)7-9-16/h6-9,12-13,27H,4-5,10-11,14H2,1-3H3,(H,26,32)
NCI pathway
Reactome pathway
>1.00E+3n/an/an/an/an/an/an/an/a
University of Ferrara
Curated by ChEMBL
Assay Description
Displacement of [3H]ZM241385 from human recombinant adenosine A2A receptor expressed in CHO cells after 120 mins by scintillation counting
J Med Chem 55: 797-811 (2012)
Article DOI: 10.1021/jm201292w
BindingDB Entry DOI: 10.7270/Q2862GXT
Adenosine receptor A2b
(Homo sapiens (Human))
BDBM50365319
(CHEMBL1955925)
Show SMILES CCCn1c2cc([nH]c2c(=O)n(CCC)c1=O)-c1cc(OCC(=O)Nc2ccc(F)cc2)nn1C
Show InChI InChI=1S/C24H27FN6O4/c1-4-10-30-19-12-17(27-22(19)23(33)31(11-5-2)24(30)34)18-13-21(28-29(18)3)35-14-20(32)26-16-8-6-15(25)7-9-16/h6-9,12-13,27H,4-5,10-11,14H2,1-3H3,(H,26,32)
NCI pathway
Reactome pathway
n/an/a 43n/an/an/an/an/an/a
University of Ferrara
Curated by ChEMBL
Assay Description
Antagonist activity at human recombinant adenosine A2B receptor expressed in CHO cells assessed as inhibition of NECA-induced [3H]cAMP production aft...
J Med Chem 55: 797-811 (2012)
Article DOI: 10.1021/jm201292w
BindingDB Entry DOI: 10.7270/Q2862GXT