BDBM50365324 CHEMBL1955901
SMILES: CCCn1c2nc([nH]c2c(=O)n(CCC)c1=O)-c1cc(OCc2nc3ccc(Br)cc3[nH]2)nn1C
InChI Key: InChIKey=DOKHKQAPSVBYBJ-UHFFFAOYSA-N
Data: 4 KI  1 IC50
Activity Spreadsheet -- Enzyme Inhibition Constant Data from BindingDB
Found 5 hits for monomerid = 50365324
Trg + Lig
Ki
nM
ΔG°
kcal/mole
IC50
nM
Kd
nM
EC50/IC50
nM
koff
s-1
kon
M-1s-1
pHTemp
°C
Adenosine receptor A2b
(Homo sapiens (Human))
BDBM50365324
(CHEMBL1955901)
Show SMILES CCCn1c2nc([nH]c2c(=O)n(CCC)c1=O)-c1cc(OCc2nc3ccc(Br)cc3[nH]2)nn1C
Show InChI InChI=1S/C23H25BrN8O3/c1-4-8-31-21-19(22(33)32(9-5-2)23(31)34)27-20(28-21)16-11-18(29-30(16)3)35-12-17-25-14-7-6-13(24)10-15(14)26-17/h6-7,10-11H,4-5,8-9,12H2,1-3H3,(H,25,26)(H,27,28)
NCI pathway
Reactome pathway
15.9n/an/an/an/an/an/an/an/a
University of Ferrara
Curated by ChEMBL
Assay Description
Displacement of [3H]MRE2029-F20 from human recombinant adenosine A2B receptor expressed in HEK293 cells after 120 mins by scintillation counting
J Med Chem 55: 797-811 (2012)
Article DOI: 10.1021/jm201292w
BindingDB Entry DOI: 10.7270/Q2862GXT
Adenosine receptor A1
(Homo sapiens (Human))
BDBM50365324
(CHEMBL1955901)
Show SMILES CCCn1c2nc([nH]c2c(=O)n(CCC)c1=O)-c1cc(OCc2nc3ccc(Br)cc3[nH]2)nn1C
Show InChI InChI=1S/C23H25BrN8O3/c1-4-8-31-21-19(22(33)32(9-5-2)23(31)34)27-20(28-21)16-11-18(29-30(16)3)35-12-17-25-14-7-6-13(24)10-15(14)26-17/h6-7,10-11H,4-5,8-9,12H2,1-3H3,(H,25,26)(H,27,28)
Reactome pathway
280n/an/an/an/an/an/an/an/a
University of Ferrara
Curated by ChEMBL
Assay Description
Displacement of [3H]DPCPX from human recombinant adenosine A1 receptor expressed in CHO cells after 120 mins by scintillation counting
J Med Chem 55: 797-811 (2012)
Article DOI: 10.1021/jm201292w
BindingDB Entry DOI: 10.7270/Q2862GXT
Adenosine receptor A2a
(Homo sapiens (Human))
BDBM50365324
(CHEMBL1955901)
Show SMILES CCCn1c2nc([nH]c2c(=O)n(CCC)c1=O)-c1cc(OCc2nc3ccc(Br)cc3[nH]2)nn1C
Show InChI InChI=1S/C23H25BrN8O3/c1-4-8-31-21-19(22(33)32(9-5-2)23(31)34)27-20(28-21)16-11-18(29-30(16)3)35-12-17-25-14-7-6-13(24)10-15(14)26-17/h6-7,10-11H,4-5,8-9,12H2,1-3H3,(H,25,26)(H,27,28)
NCI pathway
Reactome pathway
>1.00E+3n/an/an/an/an/an/an/an/a
University of Ferrara
Curated by ChEMBL
Assay Description
Displacement of [3H]ZM241385 from human recombinant adenosine A2A receptor expressed in CHO cells after 120 mins by scintillation counting
J Med Chem 55: 797-811 (2012)
Article DOI: 10.1021/jm201292w
BindingDB Entry DOI: 10.7270/Q2862GXT
Adenosine receptor A3
(Homo sapiens (Human))
BDBM50365324
(CHEMBL1955901)
Show SMILES CCCn1c2nc([nH]c2c(=O)n(CCC)c1=O)-c1cc(OCc2nc3ccc(Br)cc3[nH]2)nn1C
Show InChI InChI=1S/C23H25BrN8O3/c1-4-8-31-21-19(22(33)32(9-5-2)23(31)34)27-20(28-21)16-11-18(29-30(16)3)35-12-17-25-14-7-6-13(24)10-15(14)26-17/h6-7,10-11H,4-5,8-9,12H2,1-3H3,(H,25,26)(H,27,28)
Reactome pathway
>1.00E+3n/an/an/an/an/an/an/an/a
University of Ferrara
Curated by ChEMBL
Assay Description
Displacement of [3H]MRE3008-F20 from human recombinant adenosine A3 receptor expressed in CHO cells after 120 mins by scintillation counting
J Med Chem 55: 797-811 (2012)
Article DOI: 10.1021/jm201292w
BindingDB Entry DOI: 10.7270/Q2862GXT
Adenosine receptor A2b
(Homo sapiens (Human))
BDBM50365324
(CHEMBL1955901)
Show SMILES CCCn1c2nc([nH]c2c(=O)n(CCC)c1=O)-c1cc(OCc2nc3ccc(Br)cc3[nH]2)nn1C
Show InChI InChI=1S/C23H25BrN8O3/c1-4-8-31-21-19(22(33)32(9-5-2)23(31)34)27-20(28-21)16-11-18(29-30(16)3)35-12-17-25-14-7-6-13(24)10-15(14)26-17/h6-7,10-11H,4-5,8-9,12H2,1-3H3,(H,25,26)(H,27,28)
NCI pathway
Reactome pathway
n/an/a 62n/an/an/an/an/an/a
University of Ferrara
Curated by ChEMBL
Assay Description
Antagonist activity at human recombinant adenosine A2B receptor expressed in CHO cells assessed as inhibition of NECA-induced [3H]cAMP production aft...
J Med Chem 55: 797-811 (2012)
Article DOI: 10.1021/jm201292w
BindingDB Entry DOI: 10.7270/Q2862GXT