null
SMILES: CC[C@H](C)[C@H](NC(=O)[C@@H](CCCCN)NC(=O)N[C@@H](Cc1ccccc1)C(O)=O)C(=O)N[C@@H](Cc1ccccc1)C(N)=O
InChI Key: InChIKey=NFLQSVIBNHYLEC-SSKCBDBQSA-N
Activity Spreadsheet -- Enzyme Inhibition Constant Data from BindingDB
Found 1 hit for monomerid = 50365329
Trg + Lig
Ki
nM
ΔG°
kcal/mole
IC50
nM
Kd
nM
EC50/IC50
nM
koff
s-1
kon
M-1s-1
pHTemp
°C
Carboxypeptidase A1
(Bos taurus (bovine))
BDBM50365329
(CHEMBL1955931)
Show SMILES CC[C@H](C)[C@H](NC(=O)[C@@H](CCCCN)NC(=O)N[C@@H](Cc1ccccc1)C(O)=O)C(=O)N[C@@H](Cc1ccccc1)C(N)=O |r|
Show InChI InChI=1S/C31H44N6O6/c1-3-20(2)26(29(40)34-24(27(33)38)18-21-12-6-4-7-13-21)37-28(39)23(16-10-11-17-32)35-31(43)36-25(30(41)42)19-22-14-8-5-9-15-22/h4-9,12-15,20,23-26H,3,10-11,16-19,32H2,1-2H3,(H2,33,38)(H,34,40)(H,37,39)(H,41,42)(H2,35,36,43)/t20-,23+,24-,25-,26-/m0/s1
n/an/a 4.50E+3n/an/an/an/an/an/a
National Institute of Diabetes and Digestive and Kidney Diseases
Curated by ChEMBL
Assay Description
Inhibition of bovine pancreas carboxypeptidase A using N-(4-methoxyphenylazoformyl)-phenylalanine as substrate after 5 mins by colorimetry
J Med Chem 55: 735-42 (2012)
Article DOI: 10.1021/jm201238p
BindingDB Entry DOI: 10.7270/Q24F1R7Z