BDBM50365475 CHEMBL1957360
SMILES: CCOc1ccccc1-c1ccc(cc1)-c1cc(O)c2cnccc2n1
InChI Key: InChIKey=MVEWARNTEWZBPQ-UHFFFAOYSA-N
Data: 1 IC50
Activity Spreadsheet -- Enzyme Inhibition Constant Data from BindingDB
Found 1 hit for monomerid = 50365475
Trg + Lig
Ki
nM
ΔG°
kcal/mole
IC50
nM
Kd
nM
EC50/IC50
nM
koff
s-1
kon
M-1s-1
pHTemp
°C
cAMP and cAMP-inhibited cGMP 3',5'-cyclic phosphodiesterase 10A
(Homo sapiens (Human))
BDBM50365475
(CHEMBL1957360)
Show SMILES CCOc1ccccc1-c1ccc(cc1)-c1cc(O)c2cnccc2n1
Show InChI InChI=1S/C22H18N2O2/c1-2-26-22-6-4-3-5-17(22)15-7-9-16(10-8-15)20-13-21(25)18-14-23-12-11-19(18)24-20/h3-14H,2H2,1H3,(H,24,25)
Reactome pathway
n/an/a 561n/an/an/an/an/an/a
AstraZeneca
Curated by ChEMBL
Assay Description
Inhibition of human recombinant full length PDE10A using cAMP as substrate preincubated for 20 mins measured after 4 hrs
Bioorg Med Chem Lett 22: 1944-8 (2012)
Article DOI: 10.1016/j.bmcl.2012.01.046
BindingDB Entry DOI: 10.7270/Q2KH0NTP