BDBM50365494 CHEMBL1957381
SMILES: Cc1cc(ccn1)-c1ccc(cc1)-c1nc2ccncc2c(O)c1C#N
InChI Key: InChIKey=LKTSKFINPOYPKI-UHFFFAOYSA-N
Data: 2 IC50
Activity Spreadsheet -- Enzyme Inhibition Constant Data from BindingDB
Found 2 hits for monomerid = 50365494
Trg + Lig
Ki
nM
ΔG°
kcal/mole
IC50
nM
Kd
nM
EC50/IC50
nM
koff
s-1
kon
M-1s-1
pHTemp
°C
Dihydroorotate dehydrogenase
(Homo sapiens (Human))
BDBM50365494
(CHEMBL1957381)
Show SMILES Cc1cc(ccn1)-c1ccc(cc1)-c1nc2ccncc2c(O)c1C#N
Show InChI InChI=1S/C21H14N4O/c1-13-10-16(6-9-24-13)14-2-4-15(5-3-14)20-17(11-22)21(26)18-12-23-8-7-19(18)25-20/h2-10,12H,1H3,(H,25,26)
Reactome pathway
n/an/a>9.90E+3n/an/an/an/an/an/a
AstraZeneca
Curated by ChEMBL
Assay Description
Inhibition of human recombinant DHODH transmembrane domain using 2,6-dichloroindophenol sodium, L-Dihydroorotic acid, and decylubiquinone as substrat...
Bioorg Med Chem Lett 22: 1944-8 (2012)
Article DOI: 10.1016/j.bmcl.2012.01.046
BindingDB Entry DOI: 10.7270/Q2KH0NTP
cAMP and cAMP-inhibited cGMP 3',5'-cyclic phosphodiesterase 10A
(Homo sapiens (Human))
BDBM50365494
(CHEMBL1957381)
Show SMILES Cc1cc(ccn1)-c1ccc(cc1)-c1nc2ccncc2c(O)c1C#N
Show InChI InChI=1S/C21H14N4O/c1-13-10-16(6-9-24-13)14-2-4-15(5-3-14)20-17(11-22)21(26)18-12-23-8-7-19(18)25-20/h2-10,12H,1H3,(H,25,26)
Reactome pathway
n/an/a 27n/an/an/an/an/an/a
AstraZeneca
Curated by ChEMBL
Assay Description
Inhibition of human recombinant full length PDE10A using cAMP as substrate preincubated for 20 mins measured after 4 hrs
Bioorg Med Chem Lett 22: 1944-8 (2012)
Article DOI: 10.1016/j.bmcl.2012.01.046
BindingDB Entry DOI: 10.7270/Q2KH0NTP