null
SMILES: CS(=O)(=O)N1CCN(Cc2cn3c(Cl)c(nc(N4CCOCC4)c3n2)-c2cccc3[nH]ncc23)CC1
InChI Key: InChIKey=HLDCXWKYXYQREF-UHFFFAOYSA-N
Activity Spreadsheet -- Enzyme Inhibition Constant Data from BindingDB
Found 6 hits for monomerid = 50365509
Trg + Lig
Ki
nM
ΔG°
kcal/mole
IC50
nM
Kd
nM
EC50/IC50
nM
koff
s-1
kon
M-1s-1
pHTemp
°C
Phosphatidylinositol 3-kinase regulatory subunit alpha/4,5-bisphosphate 3-kinase catalytic subunit delta isoform
(Homo sapiens (Human))
BDBM50365509
(CHEMBL1957500)
Show SMILES CS(=O)(=O)N1CCN(Cc2cn3c(Cl)c(nc(N4CCOCC4)c3n2)-c2cccc3[nH]ncc23)CC1
Show InChI InChI=1S/C23H27ClN8O3S/c1-36(33,34)31-7-5-29(6-8-31)14-16-15-32-21(24)20(17-3-2-4-19-18(17)13-25-28-19)27-22(23(32)26-16)30-9-11-35-12-10-30/h2-4,13,15H,5-12,14H2,1H3,(H,25,28)
NCI pathway
Reactome pathway
65n/an/an/an/an/an/an/an/a
Spanish National Cancer Research Centre (CNIO). C/Melchor Fern£ndez Almagro 3
Curated by ChEMBL
Assay Description
Inhibition of human PI3K p110delta/p85alpha
Bioorg Med Chem Lett 22: 1874-8 (2012)
Article DOI: 10.1016/j.bmcl.2012.01.074
BindingDB Entry DOI: 10.7270/Q29Z95DX
Phosphatidylinositol 3-kinase regulatory subunit alpha/4,5-bisphosphate 3-kinase catalytic subunit alpha isoform
(Homo sapiens (Human))
BDBM50365509
(CHEMBL1957500)
Show SMILES CS(=O)(=O)N1CCN(Cc2cn3c(Cl)c(nc(N4CCOCC4)c3n2)-c2cccc3[nH]ncc23)CC1
Show InChI InChI=1S/C23H27ClN8O3S/c1-36(33,34)31-7-5-29(6-8-31)14-16-15-32-21(24)20(17-3-2-4-19-18(17)13-25-28-19)27-22(23(32)26-16)30-9-11-35-12-10-30/h2-4,13,15H,5-12,14H2,1H3,(H,25,28)
210n/an/an/an/an/an/an/an/a
Spanish National Cancer Research Centre (CNIO). C/Melchor Fern£ndez Almagro 3
Curated by ChEMBL
Assay Description
Inhibition of human PI3K p110alpha/p85alpha
Bioorg Med Chem Lett 22: 1874-8 (2012)
Article DOI: 10.1016/j.bmcl.2012.01.074
BindingDB Entry DOI: 10.7270/Q29Z95DX
Phosphatidylinositol 4,5-bisphosphate 3-kinase catalytic subunit gamma isoform
(Homo sapiens (Human))
BDBM50365509
(CHEMBL1957500)
Show SMILES CS(=O)(=O)N1CCN(Cc2cn3c(Cl)c(nc(N4CCOCC4)c3n2)-c2cccc3[nH]ncc23)CC1
Show InChI InChI=1S/C23H27ClN8O3S/c1-36(33,34)31-7-5-29(6-8-31)14-16-15-32-21(24)20(17-3-2-4-19-18(17)13-25-28-19)27-22(23(32)26-16)30-9-11-35-12-10-30/h2-4,13,15H,5-12,14H2,1H3,(H,25,28)
NCI pathway
Reactome pathway
>500n/an/an/an/an/an/an/an/a
Spanish National Cancer Research Centre (CNIO). C/Melchor Fern£ndez Almagro 3
Curated by ChEMBL
Assay Description
Inhibition of human PI3K p110gamma
Bioorg Med Chem Lett 22: 1874-8 (2012)
Article DOI: 10.1016/j.bmcl.2012.01.074
BindingDB Entry DOI: 10.7270/Q29Z95DX
Serine/threonine-protein kinase mTOR
(Homo sapiens (Human))
BDBM50365509
(CHEMBL1957500)
Show SMILES CS(=O)(=O)N1CCN(Cc2cn3c(Cl)c(nc(N4CCOCC4)c3n2)-c2cccc3[nH]ncc23)CC1
Show InChI InChI=1S/C23H27ClN8O3S/c1-36(33,34)31-7-5-29(6-8-31)14-16-15-32-21(24)20(17-3-2-4-19-18(17)13-25-28-19)27-22(23(32)26-16)30-9-11-35-12-10-30/h2-4,13,15H,5-12,14H2,1H3,(H,25,28)
NCI pathway
Reactome pathway
n/an/a>1.00E+4n/an/an/an/an/an/a
Spanish National Cancer Research Centre (CNIO). C/Melchor Fern£ndez Almagro 3
Curated by ChEMBL
Assay Description
Inhibition of mTOR
Bioorg Med Chem Lett 22: 1874-8 (2012)
Article DOI: 10.1016/j.bmcl.2012.01.074
BindingDB Entry DOI: 10.7270/Q29Z95DX
Phosphatidylinositol 3-kinase regulatory subunit alpha/4,5-bisphosphate 3-kinase catalytic subunit alpha isoform
(Homo sapiens (Human))
BDBM50365509
(CHEMBL1957500)
Show SMILES CS(=O)(=O)N1CCN(Cc2cn3c(Cl)c(nc(N4CCOCC4)c3n2)-c2cccc3[nH]ncc23)CC1
Show InChI InChI=1S/C23H27ClN8O3S/c1-36(33,34)31-7-5-29(6-8-31)14-16-15-32-21(24)20(17-3-2-4-19-18(17)13-25-28-19)27-22(23(32)26-16)30-9-11-35-12-10-30/h2-4,13,15H,5-12,14H2,1H3,(H,25,28)
n/an/an/an/a 495n/an/an/an/a
Spanish National Cancer Research Centre (CNIO). C/Melchor Fern£ndez Almagro 3
Curated by ChEMBL
Assay Description
Inhibition of PI3K p110alpha/p85alpha-mediated AKT1 phosphorylation at Ser473 in human U2OS cells
Bioorg Med Chem Lett 22: 1874-8 (2012)
Article DOI: 10.1016/j.bmcl.2012.01.074
BindingDB Entry DOI: 10.7270/Q29Z95DX
Phosphatidylinositol 3-kinase regulatory subunit alpha/4,5-bisphosphate 3-kinase catalytic subunit alpha isoform
(Homo sapiens (Human))
BDBM50365509
(CHEMBL1957500)
Show SMILES CS(=O)(=O)N1CCN(Cc2cn3c(Cl)c(nc(N4CCOCC4)c3n2)-c2cccc3[nH]ncc23)CC1
Show InChI InChI=1S/C23H27ClN8O3S/c1-36(33,34)31-7-5-29(6-8-31)14-16-15-32-21(24)20(17-3-2-4-19-18(17)13-25-28-19)27-22(23(32)26-16)30-9-11-35-12-10-30/h2-4,13,15H,5-12,14H2,1H3,(H,25,28)
n/an/a 145n/an/an/an/an/an/a
Spanish National Cancer Research Centre (CNIO). C/Melchor Fern£ndez Almagro 3
Curated by ChEMBL
Assay Description
Inhibition of PI3K p110alpha/p85alpha
Bioorg Med Chem Lett 22: 1874-8 (2012)
Article DOI: 10.1016/j.bmcl.2012.01.074
BindingDB Entry DOI: 10.7270/Q29Z95DX