BDBM50365773 CHEMBL1956552
SMILES: CCN(CC)CCCNc1ccc2C(=O)c3cccc4ccnc(-c2c1)c34
InChI Key: InChIKey=XNETYORDRXPMRM-UHFFFAOYSA-N
Data: 1 KI  2 IC50
Activity Spreadsheet -- Enzyme Inhibition Constant Data from BindingDB
Found 3 hits for monomerid = 50365773
Trg + Lig
Ki
nM
ΔG°
kcal/mole
IC50
nM
Kd
nM
EC50/IC50
nM
koff
s-1
kon
M-1s-1
pHTemp
°C
Acetylcholinesterase
(Electrophorus electricus (Electric eel))
BDBM50365773
(CHEMBL1956552)
Show SMILES CCN(CC)CCCNc1ccc2C(=O)c3cccc4ccnc(-c2c1)c34
Show InChI InChI=1S/C23H25N3O/c1-3-26(4-2)14-6-12-24-17-9-10-18-20(15-17)22-21-16(11-13-25-22)7-5-8-19(21)23(18)27/h5,7-11,13,15,24H,3-4,6,12,14H2,1-2H3
260n/an/an/an/an/an/an/an/a
School of Chemistry& Chemical Engineering of Guangxi Normal University
Curated by ChEMBL
Assay Description
Non-competitive inhibition of Electrophorus electricus AChE assessed as hydrolysis of acetylthiocholineiodide after 15 mins incubation by spectrophot...
Bioorg Med Chem Lett 22: 2257-61 (2012)
Article DOI: 10.1016/j.bmcl.2012.01.090
BindingDB Entry DOI: 10.7270/Q2HH6KJX
Acetylcholinesterase
(Electrophorus electricus (Electric eel))
BDBM50365773
(CHEMBL1956552)
Show SMILES CCN(CC)CCCNc1ccc2C(=O)c3cccc4ccnc(-c2c1)c34
Show InChI InChI=1S/C23H25N3O/c1-3-26(4-2)14-6-12-24-17-9-10-18-20(15-17)22-21-16(11-13-25-22)7-5-8-19(21)23(18)27/h5,7-11,13,15,24H,3-4,6,12,14H2,1-2H3
n/an/a 210n/an/an/an/an/an/a
School of Chemistry& Chemical Engineering of Guangxi Normal University
Curated by ChEMBL
Assay Description
Inhibition of Electrophorus electricus AChE using acetylthiocholine chloride as substrate after 15 mins incubation by Ellman's method
Bioorg Med Chem Lett 22: 2257-61 (2012)
Article DOI: 10.1016/j.bmcl.2012.01.090
BindingDB Entry DOI: 10.7270/Q2HH6KJX
Butyrylcholinesterase (BuChE)
(Equus caballus (Horse))
BDBM50365773
(CHEMBL1956552)
Show SMILES CCN(CC)CCCNc1ccc2C(=O)c3cccc4ccnc(-c2c1)c34
Show InChI InChI=1S/C23H25N3O/c1-3-26(4-2)14-6-12-24-17-9-10-18-20(15-17)22-21-16(11-13-25-22)7-5-8-19(21)23(18)27/h5,7-11,13,15,24H,3-4,6,12,14H2,1-2H3
n/an/a 2.81E+3n/an/an/an/an/an/a
School of Chemistry& Chemical Engineering of Guangxi Normal University
Curated by ChEMBL
Assay Description
Inhibition of equine serum BChE after 15 mins incubation by spectrophotometry based Ellman's method
Bioorg Med Chem Lett 22: 2257-61 (2012)
Article DOI: 10.1016/j.bmcl.2012.01.090
BindingDB Entry DOI: 10.7270/Q2HH6KJX