null
SMILES: NC(=O)c1ccc(cc1F)-c1cnc(Nc2ccc(cc2)N2CCOCC2)c2nccn12
InChI Key: InChIKey=CHGVCPPFYQOGNK-UHFFFAOYSA-N
Activity Spreadsheet -- Enzyme Inhibition Constant Data from BindingDB
Found 2 hits for monomerid = 50365787
Trg + Lig
Ki
nM
ΔG°
kcal/mole
IC50
nM
Kd
nM
EC50/IC50
nM
koff
s-1
kon
M-1s-1
pHTemp
°C
MAP kinase-activated protein kinase 5
(Homo sapiens (Human))
BDBM50365787
(CHEMBL1956566)
Show SMILES NC(=O)c1ccc(cc1F)-c1cnc(Nc2ccc(cc2)N2CCOCC2)c2nccn12
Show InChI InChI=1S/C23H21FN6O2/c24-19-13-15(1-6-18(19)21(25)31)20-14-27-22(23-26-7-8-30(20)23)28-16-2-4-17(5-3-16)29-9-11-32-12-10-29/h1-8,13-14H,9-12H2,(H2,25,31)(H,27,28)
NCI pathway
Reactome pathway
n/an/a>1.00E+4n/an/an/an/an/an/a
Galapagos NV
Curated by ChEMBL
Assay Description
Inhibition of MAPKAPK5 in syonovial fibroblast from rheumatoid arthritis patient assessed as inhibition of TNF-alpha-induced MMP1 expression incubate...
Bioorg Med Chem Lett 22: 2266-70 (2012)
Article DOI: 10.1016/j.bmcl.2012.01.077
BindingDB Entry DOI: 10.7270/Q2CR5TT6
MAP kinase-activated protein kinase 5
(Homo sapiens (Human))
BDBM50365787
(CHEMBL1956566)
Show SMILES NC(=O)c1ccc(cc1F)-c1cnc(Nc2ccc(cc2)N2CCOCC2)c2nccn12
Show InChI InChI=1S/C23H21FN6O2/c24-19-13-15(1-6-18(19)21(25)31)20-14-27-22(23-26-7-8-30(20)23)28-16-2-4-17(5-3-16)29-9-11-32-12-10-29/h1-8,13-14H,9-12H2,(H2,25,31)(H,27,28)
NCI pathway
Reactome pathway
n/an/a 2.39E+3n/an/an/an/an/an/a
Galapagos NV
Curated by ChEMBL
Assay Description
Inhibition of MAPKAPK5
Bioorg Med Chem Lett 22: 2266-70 (2012)
Article DOI: 10.1016/j.bmcl.2012.01.077
BindingDB Entry DOI: 10.7270/Q2CR5TT6