BDBM50365890 CHEMBL1957875
SMILES: C[C@@H](Nc1ccccc1)c1cc(C)cn2c1nc(cc2=O)N1CCOCC1
InChI Key: InChIKey=CPRAGQJXBLMUEL-MRXNPFEDSA-N
Data: 13 IC50
PDB links: 1 PDB ID matches this monomer.
Activity Spreadsheet -- Enzyme Inhibition Constant Data from BindingDB
Found 13 hits for monomerid = 50365890
Trg + Lig
Ki
nM
ΔG°
kcal/mole
IC50
nM
Kd
nM
EC50/IC50
nM
koff
s-1
kon
M-1s-1
pHTemp
°C
Phosphatidylinositol 4,5-bisphosphate 3-kinase catalytic subunit beta isoform
(Homo sapiens (Human))
BDBM50365890
(CHEMBL1957875)
Show SMILES C[C@@H](Nc1ccccc1)c1cc(C)cn2c1nc(cc2=O)N1CCOCC1 |r|
Show InChI InChI=1S/C21H24N4O2/c1-15-12-18(16(2)22-17-6-4-3-5-7-17)21-23-19(13-20(26)25(21)14-15)24-8-10-27-11-9-24/h3-7,12-14,16,22H,8-11H2,1-2H3/t16-/m1/s1
NCI pathway
Reactome pathway
n/an/a 6n/an/an/an/an/an/a
GlaxoSmithKline
Curated by ChEMBL
Assay Description
Inhibition of PI3Kbeta
Bioorg Med Chem Lett 22: 2230-4 (2012)
Article DOI: 10.1016/j.bmcl.2012.01.092
BindingDB Entry DOI: 10.7270/Q2GH9JF0
Phosphatidylinositol 4,5-bisphosphate 3-kinase catalytic subunit alpha isoform
(Homo sapiens (Human))
BDBM50365890
(CHEMBL1957875)
Show SMILES C[C@@H](Nc1ccccc1)c1cc(C)cn2c1nc(cc2=O)N1CCOCC1 |r|
Show InChI InChI=1S/C21H24N4O2/c1-15-12-18(16(2)22-17-6-4-3-5-7-17)21-23-19(13-20(26)25(21)14-15)24-8-10-27-11-9-24/h3-7,12-14,16,22H,8-11H2,1-2H3/t16-/m1/s1
NCI pathway
Reactome pathway
n/an/a 5.70E+3n/an/an/an/an/an/a
AstraZeneca
Curated by ChEMBL
Assay Description
Inhibition of human recombinant His6-tagged PI3K p110alpha expressed in baculovirus using DiC8-PI(4,5)P2 as substrate after 20 mins by AlphaScreen as...
Bioorg Med Chem Lett 22: 6665-70 (2012)
Article DOI: 10.1016/j.bmcl.2012.08.101
BindingDB Entry DOI: 10.7270/Q27H1KPB
Phosphatidylinositol 4,5-bisphosphate 3-kinase catalytic subunit beta isoform
(Homo sapiens (Human))
BDBM50365890
(CHEMBL1957875)
Show SMILES C[C@@H](Nc1ccccc1)c1cc(C)cn2c1nc(cc2=O)N1CCOCC1 |r|
Show InChI InChI=1S/C21H24N4O2/c1-15-12-18(16(2)22-17-6-4-3-5-7-17)21-23-19(13-20(26)25(21)14-15)24-8-10-27-11-9-24/h3-7,12-14,16,22H,8-11H2,1-2H3/t16-/m1/s1
NCI pathway
Reactome pathway
n/an/a 49n/an/an/an/an/an/a
AstraZeneca
Curated by ChEMBL
Assay Description
Inhibition of human recombinant His6-tagged PI3K p110beta expressed in baculovirus using DiC8-PI(4,5)P2 as substrate after 20 mins by AlphaScreen ass...
Bioorg Med Chem Lett 22: 6665-70 (2012)
Article DOI: 10.1016/j.bmcl.2012.08.101
BindingDB Entry DOI: 10.7270/Q27H1KPB
Phosphatidylinositol 4,5-bisphosphate 3-kinase catalytic subunit beta isoform
(Homo sapiens (Human))
BDBM50365890
(CHEMBL1957875)
Show SMILES C[C@@H](Nc1ccccc1)c1cc(C)cn2c1nc(cc2=O)N1CCOCC1 |r|
Show InChI InChI=1S/C21H24N4O2/c1-15-12-18(16(2)22-17-6-4-3-5-7-17)21-23-19(13-20(26)25(21)14-15)24-8-10-27-11-9-24/h3-7,12-14,16,22H,8-11H2,1-2H3/t16-/m1/s1
NCI pathway
Reactome pathway
n/an/a 30n/an/an/an/an/an/a
Sanofi Research& Development
Curated by ChEMBL
Assay Description
Inhibition of N-terminus poly-His tagged human PI3Kbeta expressed in baculovirus infected insect S21 cells coexpressing p85alpha using PI(4,5)P2 as s...
J Med Chem 55: 4788-805 (2012)
Article DOI: 10.1021/jm300241b
BindingDB Entry DOI: 10.7270/Q2R78G88
Phosphatidylinositol 4,5-bisphosphate 3-kinase catalytic subunit alpha isoform
(Homo sapiens (Human))
BDBM50365890
(CHEMBL1957875)
Show SMILES C[C@@H](Nc1ccccc1)c1cc(C)cn2c1nc(cc2=O)N1CCOCC1 |r|
Show InChI InChI=1S/C21H24N4O2/c1-15-12-18(16(2)22-17-6-4-3-5-7-17)21-23-19(13-20(26)25(21)14-15)24-8-10-27-11-9-24/h3-7,12-14,16,22H,8-11H2,1-2H3/t16-/m1/s1
NCI pathway
Reactome pathway
n/an/a>1.00E+4n/an/an/an/an/an/a
Sanofi Research& Development
Curated by ChEMBL
Assay Description
Inhibition of N-terminus poly-His tagged human PI3Kalpha expressed in baculovirus infected insect sf9 cells coexpressing p85alpha using PI(4,5)P2 as ...
J Med Chem 55: 4788-805 (2012)
Article DOI: 10.1021/jm300241b
BindingDB Entry DOI: 10.7270/Q2R78G88
Phosphatidylinositol 4,5-bisphosphate 3-kinase catalytic subunit alpha isoform
(Homo sapiens (Human))
BDBM50365890
(CHEMBL1957875)
Show SMILES C[C@@H](Nc1ccccc1)c1cc(C)cn2c1nc(cc2=O)N1CCOCC1 |r|
Show InChI InChI=1S/C21H24N4O2/c1-15-12-18(16(2)22-17-6-4-3-5-7-17)21-23-19(13-20(26)25(21)14-15)24-8-10-27-11-9-24/h3-7,12-14,16,22H,8-11H2,1-2H3/t16-/m1/s1
NCI pathway
Reactome pathway
n/an/a>1.00E+3n/an/an/an/an/an/a
Sanofi Research& Development
Curated by ChEMBL
Assay Description
Inhibition of human PI3Kalpha-mediated Akt phosphorylation at Ser473 residue expressed in human H460 cells after 0.5 to 2 hrs by Western blot analysi...
J Med Chem 55: 4788-805 (2012)
Article DOI: 10.1021/jm300241b
BindingDB Entry DOI: 10.7270/Q2R78G88
Phosphatidylinositol 4,5-bisphosphate 3-kinase catalytic subunit delta isoform
(Homo sapiens (Human))
BDBM50365890
(CHEMBL1957875)
Show SMILES C[C@@H](Nc1ccccc1)c1cc(C)cn2c1nc(cc2=O)N1CCOCC1 |r|
Show InChI InChI=1S/C21H24N4O2/c1-15-12-18(16(2)22-17-6-4-3-5-7-17)21-23-19(13-20(26)25(21)14-15)24-8-10-27-11-9-24/h3-7,12-14,16,22H,8-11H2,1-2H3/t16-/m1/s1
NCI pathway
Reactome pathway
n/an/a 252n/an/an/an/an/an/a
Sanofi Research& Development
Curated by ChEMBL
Assay Description
Inhibition of human PI3Kdelta-mediated Akt phosphorylation at Ser473 residue expressed in mouse MEF-3T3 cells after 0.5 to 2 hrs by Western blot anal...
J Med Chem 55: 4788-805 (2012)
Article DOI: 10.1021/jm300241b
BindingDB Entry DOI: 10.7270/Q2R78G88
Phosphatidylinositol 4,5-bisphosphate 3-kinase catalytic subunit beta isoform
(Homo sapiens (Human))
BDBM50365890
(CHEMBL1957875)
Show SMILES C[C@@H](Nc1ccccc1)c1cc(C)cn2c1nc(cc2=O)N1CCOCC1 |r|
Show InChI InChI=1S/C21H24N4O2/c1-15-12-18(16(2)22-17-6-4-3-5-7-17)21-23-19(13-20(26)25(21)14-15)24-8-10-27-11-9-24/h3-7,12-14,16,22H,8-11H2,1-2H3/t16-/m1/s1
NCI pathway
Reactome pathway
n/an/a 10n/an/an/an/an/an/a
Sanofi Research& Development
Curated by ChEMBL
Assay Description
Inhibition of human PI3Kbeta-mediated Akt phosphorylation at Ser473 residue expressed in PTEN-deficient human PC3 cells by chemiluminescence assay
J Med Chem 55: 4788-805 (2012)
Article DOI: 10.1021/jm300241b
BindingDB Entry DOI: 10.7270/Q2R78G88
Phosphatidylinositol 4,5-bisphosphate 3-kinase catalytic subunit beta isoform
(Homo sapiens (Human))
BDBM50365890
(CHEMBL1957875)
Show SMILES C[C@@H](Nc1ccccc1)c1cc(C)cn2c1nc(cc2=O)N1CCOCC1 |r|
Show InChI InChI=1S/C21H24N4O2/c1-15-12-18(16(2)22-17-6-4-3-5-7-17)21-23-19(13-20(26)25(21)14-15)24-8-10-27-11-9-24/h3-7,12-14,16,22H,8-11H2,1-2H3/t16-/m1/s1
NCI pathway
Reactome pathway
n/an/a 3n/an/an/an/an/an/a
Sanofi Research& Development
Curated by ChEMBL
Assay Description
Inhibition of human PI3Kbeta-mediated Akt phosphorylation at T308 residue expressed in PTEN-deficient human PC3 cells after 2 hrs by Western blot ana...
J Med Chem 55: 4788-805 (2012)
Article DOI: 10.1021/jm300241b
BindingDB Entry DOI: 10.7270/Q2R78G88
Phosphatidylinositol 4,5-bisphosphate 3-kinase catalytic subunit gamma isoform
(Homo sapiens (Human))
BDBM50365890
(CHEMBL1957875)
Show SMILES C[C@@H](Nc1ccccc1)c1cc(C)cn2c1nc(cc2=O)N1CCOCC1 |r|
Show InChI InChI=1S/C21H24N4O2/c1-15-12-18(16(2)22-17-6-4-3-5-7-17)21-23-19(13-20(26)25(21)14-15)24-8-10-27-11-9-24/h3-7,12-14,16,22H,8-11H2,1-2H3/t16-/m1/s1
NCI pathway
Reactome pathway
n/an/a>1.00E+4n/an/an/an/an/an/a
Sanofi Research& Development
Curated by ChEMBL
Assay Description
Inhibition of N-terminus poly-His tagged human PI3Kgamma expressed in baculovirus infected insect sf9 cells using PI(4,5)P2 as substrate preincubated...
J Med Chem 55: 4788-805 (2012)
Article DOI: 10.1021/jm300241b
BindingDB Entry DOI: 10.7270/Q2R78G88
Phosphatidylinositol 4,5-bisphosphate 3-kinase catalytic subunit delta isoform
(Homo sapiens (Human))
BDBM50365890
(CHEMBL1957875)
Show SMILES C[C@@H](Nc1ccccc1)c1cc(C)cn2c1nc(cc2=O)N1CCOCC1 |r|
Show InChI InChI=1S/C21H24N4O2/c1-15-12-18(16(2)22-17-6-4-3-5-7-17)21-23-19(13-20(26)25(21)14-15)24-8-10-27-11-9-24/h3-7,12-14,16,22H,8-11H2,1-2H3/t16-/m1/s1
NCI pathway
Reactome pathway
n/an/a 851n/an/an/an/an/an/a
Sanofi Research& Development
Curated by ChEMBL
Assay Description
Inhibition of poly-His tagged human PI3Kdelta expressed in baculovirus infected insect sf9 cells coexpressing p85alpha using PI(4,5)P2 as substrate p...
J Med Chem 55: 4788-805 (2012)
Article DOI: 10.1021/jm300241b
BindingDB Entry DOI: 10.7270/Q2R78G88
Phosphatidylinositol 4,5-bisphosphate 3-kinase catalytic subunit gamma isoform
(Homo sapiens (Human))
BDBM50365890
(CHEMBL1957875)
Show SMILES C[C@@H](Nc1ccccc1)c1cc(C)cn2c1nc(cc2=O)N1CCOCC1 |r|
Show InChI InChI=1S/C21H24N4O2/c1-15-12-18(16(2)22-17-6-4-3-5-7-17)21-23-19(13-20(26)25(21)14-15)24-8-10-27-11-9-24/h3-7,12-14,16,22H,8-11H2,1-2H3/t16-/m1/s1
NCI pathway
Reactome pathway
n/an/a>1.00E+3n/an/an/an/an/an/a
Sanofi Research& Development
Curated by ChEMBL
Assay Description
Inhibition of human PI3Kgamma-mediated Akt phosphorylation at Ser473 residue expressed in mouse RAW264.7 cells after 0.5 to 2 hrs by Western blot ana...
J Med Chem 55: 4788-805 (2012)
Article DOI: 10.1021/jm300241b
BindingDB Entry DOI: 10.7270/Q2R78G88
Phosphatidylinositol 4,5-bisphosphate 3-kinase catalytic subunit beta isoform
(Homo sapiens (Human))
BDBM50365890
(CHEMBL1957875)
Show SMILES C[C@@H](Nc1ccccc1)c1cc(C)cn2c1nc(cc2=O)N1CCOCC1 |r|
Show InChI InChI=1S/C21H24N4O2/c1-15-12-18(16(2)22-17-6-4-3-5-7-17)21-23-19(13-20(26)25(21)14-15)24-8-10-27-11-9-24/h3-7,12-14,16,22H,8-11H2,1-2H3/t16-/m1/s1
NCI pathway
Reactome pathway
n/an/a 11n/an/an/an/an/an/a
Sanofi Research& Development
Curated by ChEMBL
Assay Description
Inhibition of human PI3Kbeta-mediated Akt phosphorylation at Ser473 residue expressed in mouse MEF-3T3 cells after 0.5 to 2 hrs by Western blot analy...
J Med Chem 55: 4788-805 (2012)
Article DOI: 10.1021/jm300241b
BindingDB Entry DOI: 10.7270/Q2R78G88