null
SMILES: CCCCCCC[C@@](O)(C(N)=O)c1cccc(Cl)c1
InChI Key: InChIKey=YAKWOONSXDDYMF-HNNXBMFYSA-N
Activity Spreadsheet -- Enzyme Inhibition Constant Data from BindingDB
Found 2 hits for monomerid = 50365940
Trg + Lig
Ki
nM
ΔG°
kcal/mole
IC50
nM
Kd
nM
EC50/IC50
nM
koff
s-1
kon
M-1s-1
pHTemp
°C
Sodium channel protein type 9 subunit alpha
(Homo sapiens (Human))
BDBM50365940
(CHEMBL1958462)
Show SMILES CCCCCCC[C@@](O)(C(N)=O)c1cccc(Cl)c1 |r|
Show InChI InChI=1S/C15H22ClNO2/c1-2-3-4-5-6-10-15(19,14(17)18)12-8-7-9-13(16)11-12/h7-9,11,19H,2-6,10H2,1H3,(H2,17,18)/t15-/m0/s1
n/an/a 2.62E+3n/an/an/an/an/an/a
University of Virginia
Curated by ChEMBL
Assay Description
Inhibition of human voltage-gated sodium channel 1.7 expressed in HEK293 cells assessed as changes in membranre potential after 45 mins by FRET analy...
Bioorg Med Chem 20: 2180-8 (2012)
Article DOI: 10.1016/j.bmc.2011.08.061
BindingDB Entry DOI: 10.7270/Q2377961
Sodium channel protein type 5 subunit alpha
(Homo sapiens (Human))
BDBM50365940
(CHEMBL1958462)
Show SMILES CCCCCCC[C@@](O)(C(N)=O)c1cccc(Cl)c1 |r|
Show InChI InChI=1S/C15H22ClNO2/c1-2-3-4-5-6-10-15(19,14(17)18)12-8-7-9-13(16)11-12/h7-9,11,19H,2-6,10H2,1H3,(H2,17,18)/t15-/m0/s1
n/an/a 4.78E+3n/an/an/an/an/an/a
University of Virginia
Curated by ChEMBL
Assay Description
Inhibition of human voltage-gated sodium channel 1.5 expressed in HEK293 cells assessed as changes in membranre potential after 45 mins by FRET analy...
Bioorg Med Chem 20: 2180-8 (2012)
Article DOI: 10.1016/j.bmc.2011.08.061
BindingDB Entry DOI: 10.7270/Q2377961