BDBM50365989 CHEMBL1632048
SMILES: CC(C)C(=O)Nc1sc2CCCCc2c1C#N
InChI Key: InChIKey=WEQBJUFKTHOGLQ-UHFFFAOYSA-N
Data: 1 IC50
Activity Spreadsheet -- Enzyme Inhibition Constant Data from BindingDB
Found 1 hit for monomerid = 50365989
Trg + Lig
Ki
nM
ΔG°
kcal/mole
IC50
nM
Kd
nM
EC50/IC50
nM
koff
s-1
kon
M-1s-1
pHTemp
°C
Vasoactive intestinal polypeptide receptor 1
(Rattus norvegicus)
BDBM50365989
(CHEMBL1632048)
Show SMILES CC(C)C(=O)Nc1sc2CCCCc2c1C#N
Show InChI InChI=1S/C13H16N2OS/c1-8(2)12(16)15-13-10(7-14)9-5-3-4-6-11(9)17-13/h8H,3-6H2,1-2H3,(H,15,16)
n/an/a 3.40E+3n/an/an/an/an/an/a
Bristol-Myers Squibb Co.
Curated by ChEMBL
Assay Description
Antagonist activity at vasoactive intestinal peptide receptor 1 in rat RKE cells assessed as inhibition of VIP-induced intracellular cAMP accumulatio...
Bioorg Med Chem Lett 22: 2287-90 (2012)
Article DOI: 10.1016/j.bmcl.2012.01.082
BindingDB Entry DOI: 10.7270/Q2Q240QR