BDBM50366003 CHEMBL1956440
SMILES: O=C(Cc1cc2ccccc2s1)Nc1sc2CCCCc2c1C#N
InChI Key: InChIKey=VAUPLUOIZZIIIL-UHFFFAOYSA-N
Data: 1 IC50
Activity Spreadsheet -- Enzyme Inhibition Constant Data from BindingDB
Found 1 hit for monomerid = 50366003
Trg + Lig
Ki
nM
ΔG°
kcal/mole
IC50
nM
Kd
nM
EC50/IC50
nM
koff
s-1
kon
M-1s-1
pHTemp
°C
Vasoactive intestinal polypeptide receptor 1
(Rattus norvegicus)
BDBM50366003
(CHEMBL1956440)
Show SMILES O=C(Cc1cc2ccccc2s1)Nc1sc2CCCCc2c1C#N
Show InChI InChI=1S/C19H16N2OS2/c20-11-15-14-6-2-4-8-17(14)24-19(15)21-18(22)10-13-9-12-5-1-3-7-16(12)23-13/h1,3,5,7,9H,2,4,6,8,10H2,(H,21,22)
n/an/a 1.90E+3n/an/an/an/an/an/a
Bristol-Myers Squibb Co.
Curated by ChEMBL
Assay Description
Antagonist activity at vasoactive intestinal peptide receptor 1 in rat RKE cells assessed as inhibition of VIP-induced intracellular cAMP accumulatio...
Bioorg Med Chem Lett 22: 2287-90 (2012)
Article DOI: 10.1016/j.bmcl.2012.01.082
BindingDB Entry DOI: 10.7270/Q2Q240QR