BDBM50366011 CHEMBL1956258
SMILES: CC(C)c1cc(cc(-c2cccc(c2)C#N)c1CO)C(C)(C)C
InChI Key: InChIKey=XDIJLMUJOCIRMD-UHFFFAOYSA-N
Data: 1 IC50
Activity Spreadsheet -- Enzyme Inhibition Constant Data from BindingDB
Found 1 hit for monomerid = 50366011
Trg + Lig
Ki
nM
ΔG°
kcal/mole
IC50
nM
Kd
nM
EC50/IC50
nM
koff
s-1
kon
M-1s-1
pHTemp
°C
Vasoactive intestinal polypeptide receptor 1
(Rattus norvegicus)
BDBM50366011
(CHEMBL1956258)
Show SMILES CC(C)c1cc(cc(-c2cccc(c2)C#N)c1CO)C(C)(C)C
Show InChI InChI=1S/C21H25NO/c1-14(2)18-10-17(21(3,4)5)11-19(20(18)13-23)16-8-6-7-15(9-16)12-22/h6-11,14,23H,13H2,1-5H3
n/an/a>5.00E+4n/an/an/an/an/an/a
Bristol-Myers Squibb Co.
Curated by ChEMBL
Assay Description
Antagonist activity at vasoactive intestinal peptide receptor 1 in rat RKE cells assessed as inhibition of VIP-induced intracellular cAMP accumulatio...
Bioorg Med Chem Lett 22: 2287-90 (2012)
Article DOI: 10.1016/j.bmcl.2012.01.082
BindingDB Entry DOI: 10.7270/Q2Q240QR