BDBM50366080 CHEMBL1956887
SMILES: Nc1nc(Nc2cccc(Br)c2)c2cc(Cc3ccc(cc3)-c3ccccc3)[nH]c2n1
InChI Key: InChIKey=OBTGJXIDKZVSAG-UHFFFAOYSA-N
Data: 4 IC50
Activity Spreadsheet -- Enzyme Inhibition Constant Data from BindingDB
Found 4 hits for monomerid = 50366080
Trg + Lig
Ki
nM
ΔG°
kcal/mole
IC50
nM
Kd
nM
EC50/IC50
nM
koff
s-1
kon
M-1s-1
pHTemp
°C
Epidermal growth factor receptor
(Homo sapiens (Human))
BDBM50366080
(CHEMBL1956887)
Show SMILES Nc1nc(Nc2cccc(Br)c2)c2cc(Cc3ccc(cc3)-c3ccccc3)[nH]c2n1
Show InChI InChI=1S/C25H20BrN5/c26-19-7-4-8-20(14-19)28-23-22-15-21(29-24(22)31-25(27)30-23)13-16-9-11-18(12-10-16)17-5-2-1-3-6-17/h1-12,14-15H,13H2,(H4,27,28,29,30,31)
n/an/a 6.16E+3n/an/an/an/an/an/a
Duquesne University
Curated by ChEMBL
Assay Description
Inhibition of EGFR
Bioorg Med Chem 20: 2444-54 (2012)
Article DOI: 10.1016/j.bmc.2012.01.029
BindingDB Entry DOI: 10.7270/Q2XK8G14
Platelet-derived growth factor receptor beta
(Homo sapiens (Human))
BDBM50366080
(CHEMBL1956887)
Show SMILES Nc1nc(Nc2cccc(Br)c2)c2cc(Cc3ccc(cc3)-c3ccccc3)[nH]c2n1
Show InChI InChI=1S/C25H20BrN5/c26-19-7-4-8-20(14-19)28-23-22-15-21(29-24(22)31-25(27)30-23)13-16-9-11-18(12-10-16)17-5-2-1-3-6-17/h1-12,14-15H,13H2,(H4,27,28,29,30,31)
NCI pathway
Reactome pathway
n/an/a>5.00E+4n/an/an/an/an/an/a
Duquesne University
Curated by ChEMBL
Assay Description
Inhibition of PDGFRbeta
Bioorg Med Chem 20: 2444-54 (2012)
Article DOI: 10.1016/j.bmc.2012.01.029
BindingDB Entry DOI: 10.7270/Q2XK8G14
Vascular endothelial growth factor receptor 2
(Homo sapiens (Human))
BDBM50366080
(CHEMBL1956887)
Show SMILES Nc1nc(Nc2cccc(Br)c2)c2cc(Cc3ccc(cc3)-c3ccccc3)[nH]c2n1
Show InChI InChI=1S/C25H20BrN5/c26-19-7-4-8-20(14-19)28-23-22-15-21(29-24(22)31-25(27)30-23)13-16-9-11-18(12-10-16)17-5-2-1-3-6-17/h1-12,14-15H,13H2,(H4,27,28,29,30,31)
NCI pathway
Reactome pathway
n/an/a 5.97E+3n/an/an/an/an/an/a
Duquesne University
Curated by ChEMBL
Assay Description
Inhibition of VEGFR2
Bioorg Med Chem 20: 2444-54 (2012)
Article DOI: 10.1016/j.bmc.2012.01.029
BindingDB Entry DOI: 10.7270/Q2XK8G14
Vascular endothelial growth factor receptor 1
(Homo sapiens (Human))
BDBM50366080
(CHEMBL1956887)
Show SMILES Nc1nc(Nc2cccc(Br)c2)c2cc(Cc3ccc(cc3)-c3ccccc3)[nH]c2n1
Show InChI InChI=1S/C25H20BrN5/c26-19-7-4-8-20(14-19)28-23-22-15-21(29-24(22)31-25(27)30-23)13-16-9-11-18(12-10-16)17-5-2-1-3-6-17/h1-12,14-15H,13H2,(H4,27,28,29,30,31)
n/an/a>5.00E+4n/an/an/an/an/an/a
Duquesne University
Curated by ChEMBL
Assay Description
Inhibition of VEGFR1
Bioorg Med Chem 20: 2444-54 (2012)
Article DOI: 10.1016/j.bmc.2012.01.029
BindingDB Entry DOI: 10.7270/Q2XK8G14