BDBM50366122 CHEMBL1957211
SMILES: Clc1ccc(cc1)-c1nc(cs1)-c1cccnc1
InChI Key: InChIKey=ITTJXMWPRXVXQA-UHFFFAOYSA-N
Data: 1 KI  1 IC50
Activity Spreadsheet -- Enzyme Inhibition Constant Data from BindingDB
Found 2 hits for monomerid = 50366122
Trg + Lig
Ki
nM
ΔG°
kcal/mole
IC50
nM
Kd
nM
EC50/IC50
nM
koff
s-1
kon
M-1s-1
pHTemp
°C
Cytochrome P450 19A1
(Homo sapiens (Human))
BDBM50366122
(CHEMBL1957211)
Show SMILES Clc1ccc(cc1)-c1nc(cs1)-c1cccnc1
Show InChI InChI=1S/C14H9ClN2S/c15-12-5-3-10(4-6-12)14-17-13(9-18-14)11-2-1-7-16-8-11/h1-9H
Reactome pathway
234n/an/an/an/an/an/an/an/a
Purdue University
Curated by ChEMBL
Assay Description
Competitive inhibition of human aromatase using dibenzylfluorescein substrate after 10 mins preincubation measured every 10 sec for 5 mins by Michael...
Bioorg Med Chem 20: 2427-34 (2012)
Article DOI: 10.1016/j.bmc.2012.01.047
BindingDB Entry DOI: 10.7270/Q2DJ5G3W
Cytochrome P450 19A1
(Homo sapiens (Human))
BDBM50366122
(CHEMBL1957211)
Show SMILES Clc1ccc(cc1)-c1nc(cs1)-c1cccnc1
Show InChI InChI=1S/C14H9ClN2S/c15-12-5-3-10(4-6-12)14-17-13(9-18-14)11-2-1-7-16-8-11/h1-9H
Reactome pathway
n/an/a 2.39E+3n/an/an/an/an/an/a
Purdue University
Curated by ChEMBL
Assay Description
Inhibition of human aromatase using dibenzylfluorescein substrate preincubated for 30 mins measured after 30 mins by fluorescence assay
Bioorg Med Chem 20: 2427-34 (2012)
Article DOI: 10.1016/j.bmc.2012.01.047
BindingDB Entry DOI: 10.7270/Q2DJ5G3W