BDBM50366130 CHEMBL1957219
SMILES: Brc1ccc(cn1)-c1csc(n1)-c1ccncc1
InChI Key: InChIKey=GXAMFEXHKCHEHF-UHFFFAOYSA-N
Data: 1 KI  1 IC50
Activity Spreadsheet -- Enzyme Inhibition Constant Data from BindingDB
Found 2 hits for monomerid = 50366130
Trg + Lig
Ki
nM
ΔG°
kcal/mole
IC50
nM
Kd
nM
EC50/IC50
nM
koff
s-1
kon
M-1s-1
pHTemp
°C
Cytochrome P450 19A1
(Homo sapiens (Human))
BDBM50366130
(CHEMBL1957219)
Show SMILES Brc1ccc(cn1)-c1csc(n1)-c1ccncc1
Show InChI InChI=1S/C13H8BrN3S/c14-12-2-1-10(7-16-12)11-8-18-13(17-11)9-3-5-15-6-4-9/h1-8H
Reactome pathway
285n/an/an/an/an/an/an/an/a
Purdue University
Curated by ChEMBL
Assay Description
Competitive inhibition of human aromatase using dibenzylfluorescein substrate after 10 mins preincubation measured every 10 sec for 5 mins by Michael...
Bioorg Med Chem 20: 2427-34 (2012)
Article DOI: 10.1016/j.bmc.2012.01.047
BindingDB Entry DOI: 10.7270/Q2DJ5G3W
Cytochrome P450 19A1
(Homo sapiens (Human))
BDBM50366130
(CHEMBL1957219)
Show SMILES Brc1ccc(cn1)-c1csc(n1)-c1ccncc1
Show InChI InChI=1S/C13H8BrN3S/c14-12-2-1-10(7-16-12)11-8-18-13(17-11)9-3-5-15-6-4-9/h1-8H
Reactome pathway
n/an/a 2.68E+3n/an/an/an/an/an/a
Purdue University
Curated by ChEMBL
Assay Description
Inhibition of human aromatase using dibenzylfluorescein substrate preincubated for 30 mins measured after 30 mins by fluorescence assay
Bioorg Med Chem 20: 2427-34 (2012)
Article DOI: 10.1016/j.bmc.2012.01.047
BindingDB Entry DOI: 10.7270/Q2DJ5G3W