BDBM50366132 CHEMBL1957221
SMILES: COc1ccc(cn1)-c1csc(n1)-c1ccncc1
InChI Key: InChIKey=UWOWYLWXAGOBPH-UHFFFAOYSA-N
Data: 1 KI  1 IC50
Activity Spreadsheet -- Enzyme Inhibition Constant Data from BindingDB
Found 2 hits for monomerid = 50366132
Trg + Lig
Ki
nM
ΔG°
kcal/mole
IC50
nM
Kd
nM
EC50/IC50
nM
koff
s-1
kon
M-1s-1
pHTemp
°C
Cytochrome P450 19A1
(Homo sapiens (Human))
BDBM50366132
(CHEMBL1957221)
Show SMILES COc1ccc(cn1)-c1csc(n1)-c1ccncc1
Show InChI InChI=1S/C14H11N3OS/c1-18-13-3-2-11(8-16-13)12-9-19-14(17-12)10-4-6-15-7-5-10/h2-9H,1H3
Reactome pathway
83n/an/an/an/an/an/an/an/a
Purdue University
Curated by ChEMBL
Assay Description
Competitive inhibition of human aromatase using dibenzylfluorescein substrate after 10 mins preincubation measured every 10 sec for 5 mins by Michael...
Bioorg Med Chem 20: 2427-34 (2012)
Article DOI: 10.1016/j.bmc.2012.01.047
BindingDB Entry DOI: 10.7270/Q2DJ5G3W
Cytochrome P450 19A1
(Homo sapiens (Human))
BDBM50366132
(CHEMBL1957221)
Show SMILES COc1ccc(cn1)-c1csc(n1)-c1ccncc1
Show InChI InChI=1S/C14H11N3OS/c1-18-13-3-2-11(8-16-13)12-9-19-14(17-12)10-4-6-15-7-5-10/h2-9H,1H3
Reactome pathway
n/an/a 1.04E+3n/an/an/an/an/an/a
Purdue University
Curated by ChEMBL
Assay Description
Inhibition of human aromatase using dibenzylfluorescein substrate preincubated for 30 mins measured after 30 mins by fluorescence assay
Bioorg Med Chem 20: 2427-34 (2012)
Article DOI: 10.1016/j.bmc.2012.01.047
BindingDB Entry DOI: 10.7270/Q2DJ5G3W