BDBM50366346 CHEMBL1790477
SMILES: CC[C@@H](C)[C@H](NC(=O)[C@@H](NC(=O)[C@@H](N)CS)C(C)C)C(=O)N[C@@H](CCSC)C(O)=O
InChI Key: InChIKey=WGRDTCQSCXOTES-QTVXIADOSA-N
Data: 2 IC50
Activity Spreadsheet -- Enzyme Inhibition Constant Data from BindingDB
Found 2 hits for monomerid = 50366346
Trg + Lig
Ki
nM
ΔG°
kcal/mole
IC50
nM
Kd
nM
EC50/IC50
nM
koff
s-1
kon
M-1s-1
pHTemp
°C
Protein Farnesyltransferase (PFT)
(Homo sapiens (Human))
BDBM50366346
(CHEMBL1790477)
Show SMILES CC[C@@H](C)[C@H](NC(=O)[C@@H](NC(=O)[C@@H](N)CS)C(C)C)C(=O)N[C@@H](CCSC)C(O)=O
Show InChI InChI=1S/C19H36N4O5S2/c1-6-11(4)15(18(26)21-13(19(27)28)7-8-30-5)23-17(25)14(10(2)3)22-16(24)12(20)9-29/h10-15,29H,6-9,20H2,1-5H3,(H,21,26)(H,22,24)(H,23,25)(H,27,28)/t11-,12+,13+,14+,15+/m1/s1
Reactome pathway
n/an/a 420n/an/an/an/an/an/a
Leiden University
Curated by ChEMBL
Assay Description
Inhibition of [3H]FPP incorporation by Protein Farnesyltransferase
J Med Chem 47: 3920-3 (2004)
Article DOI: 10.1021/jm049927q
BindingDB Entry DOI: 10.7270/Q2FT8MT5
Protein Farnesyltransferase (PFT)
(Homo sapiens (Human))
BDBM50366346
(CHEMBL1790477)
Show SMILES CC[C@@H](C)[C@H](NC(=O)[C@@H](NC(=O)[C@@H](N)CS)C(C)C)C(=O)N[C@@H](CCSC)C(O)=O
Show InChI InChI=1S/C19H36N4O5S2/c1-6-11(4)15(18(26)21-13(19(27)28)7-8-30-5)23-17(25)14(10(2)3)22-16(24)12(20)9-29/h10-15,29H,6-9,20H2,1-5H3,(H,21,26)(H,22,24)(H,23,25)(H,27,28)/t11-,12+,13+,14+,15+/m1/s1
Reactome pathway
n/an/a 340n/an/an/an/an/an/a
TBA
Curated by ChEMBL
Assay Description
In vitro inhibition of [3H]FPP incorporation into recombinant P21ras of NIH3T3 cells by farnesyl transferase
Bioorg Med Chem Lett 4: 2579-2584 (1994)
Article DOI: 10.1016/S0960-894X(01)80287-0
BindingDB Entry DOI: 10.7270/Q29C6XXR