BDBM50366440 CHEMBL1790415::SC-67655
SMILES: CCCNC(=O)[C@@H](NC(=O)[C@@H]1CCCN1C(=O)[C@H](CC(O)=O)NC(=O)[C@@H]1CCCCN1C(=O)[C@@H](NC(=O)C[C@H](C)C1CCCCC1)C(C)C)[C@@H](C)O
InChI Key: InChIKey=BUKDBQNENSAVLL-GFCHLDMNSA-N
Data: 1 IC50
Activity Spreadsheet -- Enzyme Inhibition Constant Data from BindingDB
Found 1 hit for monomerid = 50366440
Trg + Lig
Ki
nM
ΔG°
kcal/mole
IC50
nM
Kd
nM
EC50/IC50
nM
koff
s-1
kon
M-1s-1
pHTemp
°C
HLA class II histocompatibility antigen DRB3-1
(Homo sapiens (Human))
BDBM50366440
(CHEMBL1790415 | SC-67655)
Show SMILES CCCNC(=O)[C@@H](NC(=O)[C@@H]1CCCN1C(=O)[C@H](CC(O)=O)NC(=O)[C@@H]1CCCCN1C(=O)[C@@H](NC(=O)C[C@H](C)C1CCCCC1)C(C)C)[C@@H](C)O
Show InChI InChI=1S/C37H62N6O9/c1-6-17-38-35(50)32(24(5)44)41-34(49)28-16-12-19-42(28)36(51)26(21-30(46)47)39-33(48)27-15-10-11-18-43(27)37(52)31(22(2)3)40-29(45)20-23(4)25-13-8-7-9-14-25/h22-28,31-32,44H,6-21H2,1-5H3,(H,38,50)(H,39,48)(H,40,45)(H,41,49)(H,46,47)/t23-,24+,26-,27-,28-,31-,32-/m0/s1
Reactome pathway
n/an/a 50n/an/an/an/an/an/a
TBA
Curated by ChEMBL
Assay Description
Ability to compete for binding to Class II MHC using ELISA assay.
Bioorg Med Chem Lett 6: 1931-1936 (1996)
Article DOI: 10.1016/0960-894X(96)00348-4
BindingDB Entry DOI: 10.7270/Q2JM2B31