null
SMILES: NC(=N)NCCC[C@@H](NC(=O)[C@@H](CCCNC(N)=N)NC(=O)CCCCCNC(=O)[C@H]1OC([C@H](O)[C@@H]1O)n1cnc2c(N)ncnc12)C(O)=O
InChI Key: InChIKey=WGSFKLJPQRFLNY-XLBFBASJSA-N
Activity Spreadsheet -- Enzyme Inhibition Constant Data from BindingDB
Found 2 hits for monomerid = 50366584
Trg + Lig
Ki
nM
ΔG°
kcal/mole
IC50
nM
Kd
nM
EC50/IC50
nM
koff
s-1
kon
M-1s-1
pHTemp
°C
Protein kinase C beta type
(Homo sapiens (Human))
BDBM50366584
(CHEMBL605688)
Show SMILES NC(=N)NCCC[C@@H](NC(=O)[C@@H](CCCNC(N)=N)NC(=O)CCCCCNC(=O)[C@H]1OC([C@H](O)[C@@H]1O)n1cnc2c(N)ncnc12)C(O)=O |r|
Show InChI InChI=1S/C28H46N14O8/c29-21-17-22(38-12-37-21)42(13-39-17)25-19(45)18(44)20(50-25)24(47)34-9-3-1-2-8-16(43)40-14(6-4-10-35-27(30)31)23(46)41-15(26(48)49)7-5-11-36-28(32)33/h12-15,18-20,25,44-45H,1-11H2,(H,34,47)(H,40,43)(H,41,46)(H,48,49)(H2,29,37,38)(H4,30,31,35)(H4,32,33,36)/t14-,15-,18+,19-,20+,25?/m1/s1
NCI pathway
Reactome pathway
n/an/a 6.90E+3n/an/an/an/an/an/a
Tartu University
Curated by ChEMBL
Assay Description
Inhibitory activity against Protein kinase C beta isoform (PKC) from pig spleen.
Bioorg Med Chem Lett 9: 1447-52 (1999)
BindingDB Entry DOI: 10.7270/Q2RF5VJB
Calcium dependent protein kinase
(Zea mays)
BDBM50366584
(CHEMBL605688)
Show SMILES NC(=N)NCCC[C@@H](NC(=O)[C@@H](CCCNC(N)=N)NC(=O)CCCCCNC(=O)[C@H]1OC([C@H](O)[C@@H]1O)n1cnc2c(N)ncnc12)C(O)=O |r|
Show InChI InChI=1S/C28H46N14O8/c29-21-17-22(38-12-37-21)42(13-39-17)25-19(45)18(44)20(50-25)24(47)34-9-3-1-2-8-16(43)40-14(6-4-10-35-27(30)31)23(46)41-15(26(48)49)7-5-11-36-28(32)33/h12-15,18-20,25,44-45H,1-11H2,(H,34,47)(H,40,43)(H,41,46)(H,48,49)(H2,29,37,38)(H4,30,31,35)(H4,32,33,36)/t14-,15-,18+,19-,20+,25?/m1/s1
n/an/a 3.50E+4n/an/an/an/an/an/a
Tartu University
Curated by ChEMBL
Assay Description
Inhibition of Calcium-dependent protein kinase 1 (CDPK-1) from maize seedlings
Bioorg Med Chem Lett 9: 1447-52 (1999)
BindingDB Entry DOI: 10.7270/Q2RF5VJB