BDBM50366587 CHEMBL611123
SMILES: NC(=N)NCCC[C@@H](NC(=O)[C@@H](CCCNC(N)=N)NC(=O)[C@@H](CCCNC(N)=N)NC(=O)[C@@H](CCCNC(N)=N)NC(=O)[C@@H](CCCNC(N)=N)NC(=O)[C@@H](CCCNC(N)=N)NC(=O)CNC(=O)[C@H]1OC([C@H](O)[C@@H]1O)n1cnc2c(N)ncnc12)C(O)=O
InChI Key: InChIKey=RQOKDGUOYJQMIS-CUDNWQCBSA-N
Data: 2 IC50
Activity Spreadsheet -- Enzyme Inhibition Constant Data from BindingDB
Found 2 hits for monomerid = 50366587
Trg + Lig
Ki
nM
ΔG°
kcal/mole
IC50
nM
Kd
nM
EC50/IC50
nM
koff
s-1
kon
M-1s-1
pHTemp
°C
Calcium dependent protein kinase
(Zea mays)
BDBM50366587
(CHEMBL611123)
Show SMILES NC(=N)NCCC[C@@H](NC(=O)[C@@H](CCCNC(N)=N)NC(=O)[C@@H](CCCNC(N)=N)NC(=O)[C@@H](CCCNC(N)=N)NC(=O)[C@@H](CCCNC(N)=N)NC(=O)[C@@H](CCCNC(N)=N)NC(=O)CNC(=O)[C@H]1OC([C@H](O)[C@@H]1O)n1cnc2c(N)ncnc12)C(O)=O |r|
Show InChI InChI=1S/C48H86N30O12/c49-33-29-34(70-20-69-33)78(21-71-29)41-31(81)30(80)32(90-41)40(87)68-19-28(79)72-22(7-1-13-62-43(50)51)35(82)73-23(8-2-14-63-44(52)53)36(83)74-24(9-3-15-64-45(54)55)37(84)75-25(10-4-16-65-46(56)57)38(85)76-26(11-5-17-66-47(58)59)39(86)77-27(42(88)89)12-6-18-67-48(60)61/h20-27,30-32,41,80-81H,1-19H2,(H,68,87)(H,72,79)(H,73,82)(H,74,83)(H,75,84)(H,76,85)(H,77,86)(H,88,89)(H2,49,69,70)(H4,50,51,62)(H4,52,53,63)(H4,54,55,64)(H4,56,57,65)(H4,58,59,66)(H4,60,61,67)/t22-,23-,24-,25-,26-,27-,30+,31-,32+,41?/m1/s1
n/an/a 6.70E+4n/an/an/an/an/an/a
Tartu University
Curated by ChEMBL
Assay Description
Inhibition of Calcium-dependent protein kinase 1 (CDPK-1) from maize seedlings
Bioorg Med Chem Lett 9: 1447-52 (1999)
BindingDB Entry DOI: 10.7270/Q2RF5VJB
Protein kinase C beta type
(Homo sapiens (Human))
BDBM50366587
(CHEMBL611123)
Show SMILES NC(=N)NCCC[C@@H](NC(=O)[C@@H](CCCNC(N)=N)NC(=O)[C@@H](CCCNC(N)=N)NC(=O)[C@@H](CCCNC(N)=N)NC(=O)[C@@H](CCCNC(N)=N)NC(=O)[C@@H](CCCNC(N)=N)NC(=O)CNC(=O)[C@H]1OC([C@H](O)[C@@H]1O)n1cnc2c(N)ncnc12)C(O)=O |r|
Show InChI InChI=1S/C48H86N30O12/c49-33-29-34(70-20-69-33)78(21-71-29)41-31(81)30(80)32(90-41)40(87)68-19-28(79)72-22(7-1-13-62-43(50)51)35(82)73-23(8-2-14-63-44(52)53)36(83)74-24(9-3-15-64-45(54)55)37(84)75-25(10-4-16-65-46(56)57)38(85)76-26(11-5-17-66-47(58)59)39(86)77-27(42(88)89)12-6-18-67-48(60)61/h20-27,30-32,41,80-81H,1-19H2,(H,68,87)(H,72,79)(H,73,82)(H,74,83)(H,75,84)(H,76,85)(H,77,86)(H,88,89)(H2,49,69,70)(H4,50,51,62)(H4,52,53,63)(H4,54,55,64)(H4,56,57,65)(H4,58,59,66)(H4,60,61,67)/t22-,23-,24-,25-,26-,27-,30+,31-,32+,41?/m1/s1
NCI pathway
Reactome pathway
n/an/a 1.00E+4n/an/an/an/an/an/a
Tartu University
Curated by ChEMBL
Assay Description
Inhibitory activity against Protein kinase C beta isoform (PKC) from pig spleen.
Bioorg Med Chem Lett 9: 1447-52 (1999)
BindingDB Entry DOI: 10.7270/Q2RF5VJB