BDBM50366763 BETANMN
SMILES: NC(=O)c1ccc[n+](c1)[C@@H]1O[C@H](COP(O)([O-])=O)[C@@H](O)[C@H]1O
InChI Key: InChIKey=DAYLJWODMCOQEW-TURQNECASA-N
Data: 2 KI  2 IC50
Activity Spreadsheet -- Enzyme Inhibition Constant Data from BindingDB
Found 4 hits for monomerid = 50366763
Trg + Lig
Ki
nM
ΔG°
kcal/mole
IC50
nM
Kd
nM
EC50/IC50
nM
koff
s-1
kon
M-1s-1
pHTemp
°C
Glutamate dehydrogenase
(Bos taurus)
BDBM50366763
(BETANMN)
Show SMILES NC(=O)c1ccc[n+](c1)[C@@H]1O[C@H](COP(O)([O-])=O)[C@@H](O)[C@H]1O |r|
Show InChI InChI=1S/C11H15N2O8P/c12-10(16)6-2-1-3-13(4-6)11-9(15)8(14)7(21-11)5-20-22(17,18)19/h1-4,7-9,11,14-15H,5H2,(H3-,12,16,17,18,19)/t7-,8-,9-,11-/m1/s1
Reactome pathway
>1.00E+7n/an/an/an/an/an/an/an/a
University of Rochester Medical Center
Curated by ChEMBL
Assay Description
In vitro inhibitory activity against bovine liver glutamate dehydrogenase (GDH)
J Med Chem 33: 1123-7 (1990)
BindingDB Entry DOI: 10.7270/Q28P6131
Alcohol dehydrogenase
(Equus caballus)
BDBM50366763
(BETANMN)
Show SMILES NC(=O)c1ccc[n+](c1)[C@@H]1O[C@H](COP(O)([O-])=O)[C@@H](O)[C@H]1O |r|
Show InChI InChI=1S/C11H15N2O8P/c12-10(16)6-2-1-3-13(4-6)11-9(15)8(14)7(21-11)5-20-22(17,18)19/h1-4,7-9,11,14-15H,5H2,(H3-,12,16,17,18,19)/t7-,8-,9-,11-/m1/s1
>1.00E+7n/an/an/an/an/an/an/an/a
University of Rochester Medical Center
Curated by ChEMBL
Assay Description
In vitro inhibitory activity against horse liver Alcohol dehydrogenase
J Med Chem 33: 1123-7 (1990)
BindingDB Entry DOI: 10.7270/Q28P6131
Glyceraldehyde-3-phosphate dehydrogenase liver
(Homo sapiens (Human))
BDBM50366763
(BETANMN)
Show SMILES NC(=O)c1ccc[n+](c1)[C@@H]1O[C@H](COP(O)([O-])=O)[C@@H](O)[C@H]1O |r|
Show InChI InChI=1S/C11H15N2O8P/c12-10(16)6-2-1-3-13(4-6)11-9(15)8(14)7(21-11)5-20-22(17,18)19/h1-4,7-9,11,14-15H,5H2,(H3-,12,16,17,18,19)/t7-,8-,9-,11-/m1/s1
NCI pathway
Reactome pathway
n/an/a>5.00E+5n/an/an/an/an/an/a
University of Washington
Curated by ChEMBL
Assay Description
Inhibitory concentration against Trypanosoma brucei glyceraldehyde-3-phosphate dehydrogenase (GAPDH)
Bioorg Med Chem Lett 11: 95-8 (2001)
BindingDB Entry DOI: 10.7270/Q2F76D3N
Glyceraldehyde-3-phosphate dehydrogenase liver
(Homo sapiens (Human))
BDBM50366763
(BETANMN)
Show SMILES NC(=O)c1ccc[n+](c1)[C@@H]1O[C@H](COP(O)([O-])=O)[C@@H](O)[C@H]1O |r|
Show InChI InChI=1S/C11H15N2O8P/c12-10(16)6-2-1-3-13(4-6)11-9(15)8(14)7(21-11)5-20-22(17,18)19/h1-4,7-9,11,14-15H,5H2,(H3-,12,16,17,18,19)/t7-,8-,9-,11-/m1/s1
NCI pathway
Reactome pathway
n/an/a>5.00E+5n/an/an/an/an/an/a
University of Washington
Curated by ChEMBL
Assay Description
Inhibitory concentration against rabbit muscle glyceraldehyde-3-phosphate dehydrogenase (GAPDH)
Bioorg Med Chem Lett 11: 95-8 (2001)
BindingDB Entry DOI: 10.7270/Q2F76D3N