null
SMILES: O=C1Nc2ccccc2C1C=Nc1ccc2[nH]c(=O)[nH]c2c1
InChI Key: InChIKey=NPRYRMBBYLENLM-UHFFFAOYSA-N
Activity Spreadsheet -- Enzyme Inhibition Constant Data from BindingDB
Found 4 hits for monomerid = 50366929
Trg + Lig
Ki
nM
ΔG°
kcal/mole
IC50
nM
Kd
nM
EC50/IC50
nM
koff
s-1
kon
M-1s-1
pHTemp
°C
RAF proto-oncogene serine/threonine-protein kinase
(Homo sapiens (Human))
BDBM50366929
(CHEMBL1794057)
Show SMILES O=C1Nc2ccccc2C1C=Nc1ccc2[nH]c(=O)[nH]c2c1 |w:10.11|
Show InChI InChI=1S/C16H12N4O2/c21-15-11(10-3-1-2-4-12(10)18-15)8-17-9-5-6-13-14(7-9)20-16(22)19-13/h1-8,11H,(H,18,21)(H2,19,20,22)
NCI pathway
Reactome pathway
n/an/a>1.00E+4n/an/an/an/an/an/a
GlaxoSmithKline
Curated by ChEMBL
Assay Description
Inhibition of c-Raf1 kinase
Bioorg Med Chem Lett 14: 953-7 (2004)
Article DOI: 10.1016/j.bmcl.2003.12.002
BindingDB Entry DOI: 10.7270/Q23R0TDF
High affinity nerve growth factor receptor
(Homo sapiens (Human))
BDBM50366929
(CHEMBL1794057)
Show SMILES O=C1Nc2ccccc2C1C=Nc1ccc2[nH]c(=O)[nH]c2c1 |w:10.11|
Show InChI InChI=1S/C16H12N4O2/c21-15-11(10-3-1-2-4-12(10)18-15)8-17-9-5-6-13-14(7-9)20-16(22)19-13/h1-8,11H,(H,18,21)(H2,19,20,22)
n/an/a 7n/an/an/an/an/an/a
TBA
Citation and Details
Cyclin-A1/Cyclin-A2/Cyclin-dependent kinase 2
(Homo sapiens (Human))
BDBM50366929
(CHEMBL1794057)
Show SMILES O=C1Nc2ccccc2C1C=Nc1ccc2[nH]c(=O)[nH]c2c1 |w:10.11|
Show InChI InChI=1S/C16H12N4O2/c21-15-11(10-3-1-2-4-12(10)18-15)8-17-9-5-6-13-14(7-9)20-16(22)19-13/h1-8,11H,(H,18,21)(H2,19,20,22)
Reactome pathway
n/an/a 2.50E+3n/an/an/an/an/an/a
GlaxoSmithKline
Curated by ChEMBL
Assay Description
Inhibition of Cyclin-dependent kinase 2 cyclin A
Bioorg Med Chem Lett 14: 953-7 (2004)
Article DOI: 10.1016/j.bmcl.2003.12.002
BindingDB Entry DOI: 10.7270/Q23R0TDF
High affinity nerve growth factor receptor
(Homo sapiens (Human))
BDBM50366929
(CHEMBL1794057)
Show SMILES O=C1Nc2ccccc2C1C=Nc1ccc2[nH]c(=O)[nH]c2c1 |w:10.11|
Show InChI InChI=1S/C16H12N4O2/c21-15-11(10-3-1-2-4-12(10)18-15)8-17-9-5-6-13-14(7-9)20-16(22)19-13/h1-8,11H,(H,18,21)(H2,19,20,22)
n/an/a 7n/an/an/an/an/an/a
GlaxoSmithKline
Curated by ChEMBL
Assay Description
Inhibition of receptor Tyrosine kinase A, TrkA (nerve growth factor receptor)
Bioorg Med Chem Lett 14: 953-7 (2004)
Article DOI: 10.1016/j.bmcl.2003.12.002
BindingDB Entry DOI: 10.7270/Q23R0TDF