BDBM50366990 CHEMBL1202589
SMILES: NCC(O)[C@@]12CC3C[C@@H](C[C@H](C3)C1)C2
InChI Key: InChIKey=GLCFWAYXPRBRNU-GQYKCQBRSA-N
Data: 1 IC50
Activity Spreadsheet -- Enzyme Inhibition Constant Data from BindingDB
Found 1 hit for monomerid = 50366990
Trg + Lig
Ki
nM
ΔG°
kcal/mole
IC50
nM
Kd
nM
EC50/IC50
nM
koff
s-1
kon
M-1s-1
pHTemp
°C
Phenylethanolamine N-methyltransferase
(Bos taurus (bovine))
BDBM50366990
(CHEMBL1202589)
Show SMILES NCC(O)[C@@]12CC3C[C@@H](C[C@H](C3)C1)C2 |r,TLB:7:8:11.6.5:12,THB:7:6:13.8.9:12|
Show InChI InChI=1S/C12H21NO/c13-7-11(14)12-4-8-1-9(5-12)3-10(2-8)6-12/h8-11,14H,1-7,13H2/t8-,9-,10?,11?,12-/m1/s1
n/an/a 1.95E+5n/an/an/an/an/an/a
TBA
Curated by ChEMBL
Assay Description
The compound was measured for the 50% inhibition of phenylethanolamine N-methyl-transferase
J Med Chem 24: 12-6 (1981)
BindingDB Entry DOI: 10.7270/Q2V40VRZ