BDBM50367174 CHEMBL1788237
SMILES: CN1C[C@@H](c2ccc(O)c(O)c2)c2cccc(N)c2C1
InChI Key: InChIKey=ODIYTWXTFQEXKZ-LBPRGKRZSA-N
Data: 1 IC50  1 EC50
Activity Spreadsheet -- Enzyme Inhibition Constant Data from BindingDB
Found 2 hits for monomerid = 50367174
Trg + Lig
Ki
nM
ΔG°
kcal/mole
IC50
nM
Kd
nM
EC50/IC50
nM
koff
s-1
kon
M-1s-1
pHTemp
°C
D(2) dopamine receptor
(Rattus norvegicus (rat))
BDBM50367174
(CHEMBL1788237)
Show SMILES CN1C[C@@H](c2ccc(O)c(O)c2)c2cccc(N)c2C1 |r|
Show InChI InChI=1S/C16H18N2O2/c1-18-8-12(10-5-6-15(19)16(20)7-10)11-3-2-4-14(17)13(11)9-18/h2-7,12,19-20H,8-9,17H2,1H3/t12-/m0/s1
Reactome pathway
n/an/a 8.58E+4n/an/an/an/an/an/a
TBA
Curated by ChEMBL
Assay Description
Concentration that produces 50 % displacement of specific [3H]spiroperidol binding to rat caudate membrane preparations.
J Med Chem 27: 28-35 (1984)
BindingDB Entry DOI: 10.7270/Q21J9BBG
cyclic AMP phosphoprotein
(Rattus norvegicus)
BDBM50367174
(CHEMBL1788237)
Show SMILES CN1C[C@@H](c2ccc(O)c(O)c2)c2cccc(N)c2C1 |r|
Show InChI InChI=1S/C16H18N2O2/c1-18-8-12(10-5-6-15(19)16(20)7-10)11-3-2-4-14(17)13(11)9-18/h2-7,12,19-20H,8-9,17H2,1H3/t12-/m0/s1
Reactome pathway
n/an/an/an/a 1.87E+3n/an/an/an/a
TBA
Curated by ChEMBL
Assay Description
Effective concentration that gives maximal stimulation of cyclic AMP production over the concentration range tested.
J Med Chem 27: 28-35 (1984)
BindingDB Entry DOI: 10.7270/Q21J9BBG