BDBM50367251 CHEMBL350097
SMILES: Nc1nc2ncc(CCc3ccc(cc3)C(=O)N[C@@H](CCC(O)=O)C(O)=O)cc2c(=O)[nH]1
InChI Key: InChIKey=BHDZQFSNQPIPGI-HNNXBMFYSA-N
Data: 3 IC50
Activity Spreadsheet -- Enzyme Inhibition Constant Data from BindingDB
Found 3 hits for monomerid = 50367251
Trg + Lig
Ki
nM
ΔG°
kcal/mole
IC50
nM
Kd
nM
EC50/IC50
nM
koff
s-1
kon
M-1s-1
pHTemp
°C
Dihydrofolate reductase
(Lactobacillus casei)
BDBM50367251
(CHEMBL350097)
Show SMILES Nc1nc2ncc(CCc3ccc(cc3)C(=O)N[C@@H](CCC(O)=O)C(O)=O)cc2c(=O)[nH]1
Show InChI InChI=1S/C21H21N5O6/c22-21-25-17-14(19(30)26-21)9-12(10-23-17)2-1-11-3-5-13(6-4-11)18(29)24-15(20(31)32)7-8-16(27)28/h3-6,9-10,15H,1-2,7-8H2,(H,24,29)(H,27,28)(H,31,32)(H3,22,23,25,26,30)/t15-/m0/s1
n/an/a 4.90E+4n/an/an/an/an/an/a
TBA
Curated by ChEMBL
Assay Description
In vitro inhibitory concentration against beef liver dihydrofolate reductase
J Med Chem 28: 914-21 (1985)
BindingDB Entry DOI: 10.7270/Q2CN74HM
Glycinamide ribonucleotide formyltransferase (GARFTase)
(Homo sapiens (Human))
BDBM50367251
(CHEMBL350097)
Show SMILES Nc1nc2ncc(CCc3ccc(cc3)C(=O)N[C@@H](CCC(O)=O)C(O)=O)cc2c(=O)[nH]1
Show InChI InChI=1S/C21H21N5O6/c22-21-25-17-14(19(30)26-21)9-12(10-23-17)2-1-11-3-5-13(6-4-11)18(29)24-15(20(31)32)7-8-16(27)28/h3-6,9-10,15H,1-2,7-8H2,(H,24,29)(H,27,28)(H,31,32)(H3,22,23,25,26,30)/t15-/m0/s1
n/an/a 16n/an/an/an/an/an/a
Harvard Medical School
Curated by ChEMBL
Assay Description
Tested in vitro for inhibitory concentration against CCRF-CEM human Leukemic lymphoblast by using GAR FTase as primary target
J Med Chem 37: 2167-74 (1994)
BindingDB Entry DOI: 10.7270/Q2Q240W0
Thymidylate Synthase (TS)
(Lactobacillus casei)
BDBM50367251
(CHEMBL350097)
Show SMILES Nc1nc2ncc(CCc3ccc(cc3)C(=O)N[C@@H](CCC(O)=O)C(O)=O)cc2c(=O)[nH]1
Show InChI InChI=1S/C21H21N5O6/c22-21-25-17-14(19(30)26-21)9-12(10-23-17)2-1-11-3-5-13(6-4-11)18(29)24-15(20(31)32)7-8-16(27)28/h3-6,9-10,15H,1-2,7-8H2,(H,24,29)(H,27,28)(H,31,32)(H3,22,23,25,26,30)/t15-/m0/s1
n/an/a 7.70E+4n/an/an/an/an/an/a
TBA
Curated by ChEMBL
Assay Description
In vitro inhibitory concentration against Lactobacillus casei thymidylate synthetase
J Med Chem 28: 914-21 (1985)
BindingDB Entry DOI: 10.7270/Q2CN74HM