BDBM50367264 CHEMBL604839
SMILES: COC(=O)Cc1ccc(NC(=O)Cc2ccc(Nc3ncnc4n(cnc34)C3O[C@H](CO)[C@@H](O)[C@H]3O)cc2)cc1
InChI Key: InChIKey=PUMWNSBPFMGMBF-QFVWJIRMSA-N
Data: 1 KI
Activity Spreadsheet -- Enzyme Inhibition Constant Data from BindingDB
Found 1 hit for monomerid = 50367264
Trg + Lig
Ki
nM
ΔG°
kcal/mole
IC50
nM
Kd
nM
EC50/IC50
nM
koff
s-1
kon
M-1s-1
pHTemp
°C
Adenosine receptor A1
(Rattus norvegicus (rat))
BDBM50367264
(CHEMBL604839)
Show SMILES COC(=O)Cc1ccc(NC(=O)Cc2ccc(Nc3ncnc4n(cnc34)C3O[C@H](CO)[C@@H](O)[C@H]3O)cc2)cc1 |r|
Show InChI InChI=1S/C27H28N6O7/c1-39-21(36)11-16-4-6-17(7-5-16)31-20(35)10-15-2-8-18(9-3-15)32-25-22-26(29-13-28-25)33(14-30-22)27-24(38)23(37)19(12-34)40-27/h2-9,13-14,19,23-24,27,34,37-38H,10-12H2,1H3,(H,31,35)(H,28,29,32)/t19-,23-,24-,27?/m1/s1
Reactome pathway
2.5n/an/an/an/an/an/an/an/a
TBA
Curated by ChEMBL
Assay Description
Inhibition of binding of 1 nM N6-[3H]cyclohexyladenosine to adenosine A1 receptor on rat cerebral cortical membranes.
J Med Chem 28: 1341-6 (1985)
BindingDB Entry DOI: 10.7270/Q2BP03CS