BDBM50367602 CHEMBL65397
SMILES: Oc1cc2[C@@H](NCCc2cc1Cl)c1ccccc1
InChI Key: InChIKey=VXQGSKLYCJFAKI-HNNXBMFYSA-N
Data: 4 KI
Activity Spreadsheet -- Enzyme Inhibition Constant Data from BindingDB
Found 4 hits for monomerid = 50367602
Trg + Lig
Ki
nM
ΔG°
kcal/mole
IC50
nM
Kd
nM
EC50/IC50
nM
koff
s-1
kon
M-1s-1
pHTemp
°C
D(1A) dopamine receptor
(RAT)
BDBM50367602
(CHEMBL65397)
Show SMILES Oc1cc2[C@@H](NCCc2cc1Cl)c1ccccc1
Show InChI InChI=1S/C15H14ClNO/c16-13-8-11-6-7-17-15(12(11)9-14(13)18)10-4-2-1-3-5-10/h1-5,8-9,15,17-18H,6-7H2/t15-/m0/s1
140n/an/an/an/an/an/an/an/a
University of North Carolina
Curated by ChEMBL
Assay Description
Inhibition of [3H]SCH-23,390 binding to Dopamine receptor D1 at 0.25 nM
J Med Chem 31: 1941-6 (1988)
BindingDB Entry DOI: 10.7270/Q20002PD
D(1A) dopamine receptor
(Homo sapiens (Human))
BDBM50367602
(CHEMBL65397)
Show SMILES Oc1cc2[C@@H](NCCc2cc1Cl)c1ccccc1
Show InChI InChI=1S/C15H14ClNO/c16-13-8-11-6-7-17-15(12(11)9-14(13)18)10-4-2-1-3-5-10/h1-5,8-9,15,17-18H,6-7H2/t15-/m0/s1
141n/an/an/an/an/an/an/an/a
University of North Carolina
Curated by ChEMBL
Assay Description
In vitro inhibition of rat liver dihydrofolate reductase.
J Med Chem 32: 2050-8 (1989)
BindingDB Entry DOI: 10.7270/Q2RV0QXV
D(2) dopamine receptor
(Homo sapiens (Human))
BDBM50367602
(CHEMBL65397)
Show SMILES Oc1cc2[C@@H](NCCc2cc1Cl)c1ccccc1
Show InChI InChI=1S/C15H14ClNO/c16-13-8-11-6-7-17-15(12(11)9-14(13)18)10-4-2-1-3-5-10/h1-5,8-9,15,17-18H,6-7H2/t15-/m0/s1
Reactome pathway
3.72E+3n/an/an/an/an/an/an/an/a
University of North Carolina
Curated by ChEMBL
Assay Description
In vitro inhibition of rat liver dihydrofolate reductase.
J Med Chem 32: 2050-8 (1989)
BindingDB Entry DOI: 10.7270/Q2RV0QXV
D(2) dopamine receptor
(Rattus norvegicus (rat))
BDBM50367602
(CHEMBL65397)
Show SMILES Oc1cc2[C@@H](NCCc2cc1Cl)c1ccccc1
Show InChI InChI=1S/C15H14ClNO/c16-13-8-11-6-7-17-15(12(11)9-14(13)18)10-4-2-1-3-5-10/h1-5,8-9,15,17-18H,6-7H2/t15-/m0/s1
Reactome pathway
3.75E+3n/an/an/an/an/an/an/an/a
University of North Carolina
Curated by ChEMBL
Assay Description
Inhibition of [3H]spiperone binding to Dopamine receptor D2 at 0.02 nM
J Med Chem 31: 1941-6 (1988)
BindingDB Entry DOI: 10.7270/Q20002PD