BDBM50367811 CHEMBL1202615
SMILES: C(CCOc1ccc(\C=C\c2nc3ccccc3o2)cc1)CCn1ccnc1
InChI Key: InChIKey=AURYGUKAUOAJHV-JLHYYAGUSA-N
Data: 2 IC50
Activity Spreadsheet -- Enzyme Inhibition Constant Data from BindingDB
Found 2 hits for monomerid = 50367811
Trg + Lig
Ki
nM
ΔG°
kcal/mole
IC50
nM
Kd
nM
EC50/IC50
nM
koff
s-1
kon
M-1s-1
pHTemp
°C
Potassium-transporting ATPase alpha chain 1/beta chain
(Homo sapiens (Human))
BDBM50367811
(CHEMBL1202615)
Show SMILES C(CCOc1ccc(\C=C\c2nc3ccccc3o2)cc1)CCn1ccnc1
Show InChI InChI=1S/C23H23N3O2/c1(4-15-26-16-14-24-18-26)5-17-27-20-11-8-19(9-12-20)10-13-23-25-21-6-2-3-7-22(21)28-23/h2-3,6-14,16,18H,1,4-5,15,17H2/b13-10+
n/an/a 230n/an/an/an/an/an/a
Ortho Pharmaceutical Corporation
Curated by ChEMBL
Assay Description
Antisecretory activity evaluated by the inhibition of 14C -AP uptake in isolated rabbit parietal cells stimulated by dibutyryl cyclic adenosine 3', 5...
J Med Chem 31: 1778-85 (1988)
BindingDB Entry DOI: 10.7270/Q20P10MZ
Potassium-transporting ATPase alpha chain 1/beta chain
(Homo sapiens (Human))
BDBM50367811
(CHEMBL1202615)
Show SMILES C(CCOc1ccc(\C=C\c2nc3ccccc3o2)cc1)CCn1ccnc1
Show InChI InChI=1S/C23H23N3O2/c1(4-15-26-16-14-24-18-26)5-17-27-20-11-8-19(9-12-20)10-13-23-25-21-6-2-3-7-22(21)28-23/h2-3,6-14,16,18H,1,4-5,15,17H2/b13-10+
n/an/a 280n/an/an/an/an/an/a
Ortho Pharmaceutical Corporation
Curated by ChEMBL
Assay Description
Antisecretory activity evaluated by the inhibition of 14C -AP uptake in isolated rabbit parietal cells stimulated by exogenous histamine
J Med Chem 31: 1778-85 (1988)
BindingDB Entry DOI: 10.7270/Q20P10MZ