BDBM50368315 PROSTRATIN
SMILES: C[C@@H]1C[C@]2(OC(C)=O)[C@H]([C@@H]3C=C(CO)C[C@@]4(O)[C@@H](C=C(C)C4=O)[C@@]13O)C2(C)C
InChI Key: InChIKey=BOJKFRKNLSCGHY-KUHYLXMHSA-N
Data: 3 KI  1 EC50
Activity Spreadsheet -- Enzyme Inhibition Constant Data from BindingDB
Found 4 hits for monomerid = 50368315
Trg + Lig
Ki
nM
ΔG°
kcal/mole
IC50
nM
Kd
nM
EC50/IC50
nM
koff
s-1
kon
M-1s-1
pHTemp
°C
Protein Kinase C, alpha
(Bos taurus (bovine))
BDBM50368315
(PROSTRATIN)
Show SMILES C[C@@H]1C[C@]2(OC(C)=O)[C@H]([C@@H]3C=C(CO)C[C@@]4(O)[C@@H](C=C(C)C4=O)[C@@]13O)C2(C)C |r,t:10,18|
Show InChI InChI=1S/C22H30O6/c1-11-6-16-20(26,18(11)25)9-14(10-23)7-15-17-19(4,5)21(17,28-13(3)24)8-12(2)22(15,16)27/h6-7,12,15-17,23,26-27H,8-10H2,1-5H3/t12-,15+,16-,17?,20-,21+,22-/m1/s1
Reactome pathway
4.80n/an/an/an/an/an/an/an/a
National Cancer Institute at Frederick
Curated by ChEMBL
Assay Description
Ability to displace bound [20-3H]-PDBU from a recombinant single isozyme (PKCalpha) in the presence of phosphatidylserine
J Med Chem 44: 1892-904 (2001)
BindingDB Entry DOI: 10.7270/Q2H995WH
Protein kinase C, PKC; classical/novel
(Homo sapiens (Human))
BDBM50368315
(PROSTRATIN)
Show SMILES C[C@@H]1C[C@]2(OC(C)=O)[C@H]([C@@H]3C=C(CO)C[C@@]4(O)[C@@H](C=C(C)C4=O)[C@@]13O)C2(C)C |r,t:10,18|
Show InChI InChI=1S/C22H30O6/c1-11-6-16-20(26,18(11)25)9-14(10-23)7-15-17-19(4,5)21(17,28-13(3)24)8-12(2)22(15,16)27/h6-7,12,15-17,23,26-27H,8-10H2,1-5H3/t12-,15+,16-,17?,20-,21+,22-/m1/s1
190n/an/an/an/an/an/an/an/a
National Cancer Institute (NCI)
Curated by ChEMBL
Assay Description
Displacement of [3H]PDBu binding to Protein kinase C of CEM cells with 10% fetal calf serum
J Med Chem 35: 1978-86 (1992)
BindingDB Entry DOI: 10.7270/Q22Z17SG
Protein kinase C, PKC; classical/novel
(Homo sapiens (Human))
BDBM50368315
(PROSTRATIN)
Show SMILES C[C@@H]1C[C@]2(OC(C)=O)[C@H]([C@@H]3C=C(CO)C[C@@]4(O)[C@@H](C=C(C)C4=O)[C@@]13O)C2(C)C |r,t:10,18|
Show InChI InChI=1S/C22H30O6/c1-11-6-16-20(26,18(11)25)9-14(10-23)7-15-17-19(4,5)21(17,28-13(3)24)8-12(2)22(15,16)27/h6-7,12,15-17,23,26-27H,8-10H2,1-5H3/t12-,15+,16-,17?,20-,21+,22-/m1/s1
210n/an/an/an/an/an/an/an/a
National Cancer Institute (NCI)
Curated by ChEMBL
Assay Description
Displacement of [3H]PDBu from Protein kinase C of CEM cells
J Med Chem 35: 1978-86 (1992)
BindingDB Entry DOI: 10.7270/Q22Z17SG
Protein kinase C (PKC)
(Homo sapiens (Human))
BDBM50368315
(PROSTRATIN)
Show SMILES C[C@@H]1C[C@]2(OC(C)=O)[C@H]([C@@H]3C=C(CO)C[C@@]4(O)[C@@H](C=C(C)C4=O)[C@@]13O)C2(C)C |r,t:10,18|
Show InChI InChI=1S/C22H30O6/c1-11-6-16-20(26,18(11)25)9-14(10-23)7-15-17-19(4,5)21(17,28-13(3)24)8-12(2)22(15,16)27/h6-7,12,15-17,23,26-27H,8-10H2,1-5H3/t12-,15+,16-,17?,20-,21+,22-/m1/s1
n/an/an/an/a 910n/an/an/an/a
Kaohsiung Medical University
Curated by ChEMBL
Assay Description
Activation of PKC in human platelet assessed as induction of platelet aggregation measured within 15 mins by tribidimetric method
J Nat Prod 79: 2658-2666 (2016)
Article DOI: 10.1021/acs.jnatprod.6b00603
BindingDB Entry DOI: 10.7270/Q24T6N3M