BDBM50368543 CHEMBL605668
SMILES: Cc1ccc(CCOc2nc(N)c3ncn(C4O[C@@H](CO)[C@H](O)[C@@H]4O)c3n2)cc1
InChI Key: InChIKey=SRWUHMQKNPGXOP-QAYVNIIMSA-N
Data: 1 KI  2 EC50
Activity Spreadsheet -- Enzyme Inhibition Constant Data from BindingDB
Found 3 hits for monomerid = 50368543
Trg + Lig
Ki
nM
ΔG°
kcal/mole
IC50
nM
Kd
nM
EC50/IC50
nM
koff
s-1
kon
M-1s-1
pHTemp
°C
Adenosine receptor A1
(Rattus norvegicus (rat))
BDBM50368543
(CHEMBL605668)
Show SMILES Cc1ccc(CCOc2nc(N)c3ncn(C4O[C@@H](CO)[C@H](O)[C@@H]4O)c3n2)cc1 |r|
Show InChI InChI=1S/C19H23N5O5/c1-10-2-4-11(5-3-10)6-7-28-19-22-16(20)13-17(23-19)24(9-21-13)18-15(27)14(26)12(8-25)29-18/h2-5,9,12,14-15,18,25-27H,6-8H2,1H3,(H2,20,22,23)/t12-,14-,15-,18?/m0/s1
Reactome pathway
48n/an/an/an/an/an/an/an/a
NIDDK
Curated by ChEMBL
Assay Description
Binding affinity against adenosine A1 receptor using [3H]-CHA or [3H]PIA as radioligand
J Med Chem 35: 407-22 (1992)
BindingDB Entry DOI: 10.7270/Q2Z89D1W
Adenosine A2 receptor
(Homo sapiens (Human))
BDBM50368543
(CHEMBL605668)
Show SMILES Cc1ccc(CCOc2nc(N)c3ncn(C4O[C@@H](CO)[C@H](O)[C@@H]4O)c3n2)cc1 |r|
Show InChI InChI=1S/C19H23N5O5/c1-10-2-4-11(5-3-10)6-7-28-19-22-16(20)13-17(23-19)24(9-21-13)18-15(27)14(26)12(8-25)29-18/h2-5,9,12,14-15,18,25-27H,6-8H2,1H3,(H2,20,22,23)/t12-,14-,15-,18?/m0/s1
n/an/an/an/a 0.191n/an/an/an/a
University of South Florida
Curated by ChEMBL
Assay Description
Concentration required for coronary arteries vasodilation at the Adenosine A2 receptor in langendorff guinea pig heart preparation
J Med Chem 34: 1340-4 (1991)
BindingDB Entry DOI: 10.7270/Q24T6KJM
Adenosine A1 receptor
(GUINEA PIG)
BDBM50368543
(CHEMBL605668)
Show SMILES Cc1ccc(CCOc2nc(N)c3ncn(C4O[C@@H](CO)[C@H](O)[C@@H]4O)c3n2)cc1 |r|
Show InChI InChI=1S/C19H23N5O5/c1-10-2-4-11(5-3-10)6-7-28-19-22-16(20)13-17(23-19)24(9-21-13)18-15(27)14(26)12(8-25)29-18/h2-5,9,12,14-15,18,25-27H,6-8H2,1H3,(H2,20,22,23)/t12-,14-,15-,18?/m0/s1
n/an/an/an/a 7.41E+3n/an/an/an/a
University of South Florida
Curated by ChEMBL
Assay Description
Effective concentration required for prolongation of the stimulus-QRS interval by 50% of the maximum response at the Adenosine A1 receptor in langend...
J Med Chem 34: 1340-4 (1991)
BindingDB Entry DOI: 10.7270/Q24T6KJM