BDBM50368763 CHEMBL1790921
SMILES: CC(C)C[C@H](NC(=O)[C@@H](NC(=O)[C@H](Cc1ccccc1)NC(C)=O)[C@H](C)O)C(=O)N[C@@H](CC(O)=O)C(=O)N[C@@H](Cc1ccccc1)C(O)=O
InChI Key: InChIKey=SKZTZSDZUORVIB-CWPIJUQSSA-N
Data: 1 IC50
Activity Spreadsheet -- Enzyme Inhibition Constant Data from BindingDB
Found 1 hit for monomerid = 50368763
Trg + Lig
Ki
nM
ΔG°
kcal/mole
IC50
nM
Kd
nM
EC50/IC50
nM
koff
s-1
kon
M-1s-1
pHTemp
°C
Ribonucleoside-diphosphate reductase M1 chain
(Mus musculus)
BDBM50368763
(CHEMBL1790921)
Show SMILES CC(C)C[C@H](NC(=O)[C@@H](NC(=O)[C@H](Cc1ccccc1)NC(C)=O)[C@H](C)O)C(=O)N[C@@H](CC(O)=O)C(=O)N[C@@H](Cc1ccccc1)C(O)=O
Show InChI InChI=1S/C34H45N5O10/c1-19(2)15-24(30(44)36-26(18-28(42)43)31(45)38-27(34(48)49)17-23-13-9-6-10-14-23)37-33(47)29(20(3)40)39-32(46)25(35-21(4)41)16-22-11-7-5-8-12-22/h5-14,19-20,24-27,29,40H,15-18H2,1-4H3,(H,35,41)(H,36,44)(H,37,47)(H,38,45)(H,39,46)(H,42,43)(H,48,49)/t20-,24-,25-,26-,27-,29-/m0/s1
Reactome pathway
n/an/a 3.64E+5n/an/an/an/an/an/a
University of Pennsylvania
Curated by ChEMBL
Assay Description
Inhibitory activity of compound against mammalian ribonucleotide reductase; Range is 364-460
J Med Chem 36: 3859-62 (1994)
BindingDB Entry DOI: 10.7270/Q2V40VTV