BDBM50369093 CHEMBL603389
SMILES: CCNC(=O)[C@H]1OC([C@H](O)[C@@H]1O)n1cnc2c(N)nc(nc12)C#Cc1ccncc1
InChI Key: InChIKey=NYSHNRMXEXEACQ-FRLFKWGPSA-N
Data: 4 KI  2 EC50
Activity Spreadsheet -- Enzyme Inhibition Constant Data from BindingDB
Found 6 hits for monomerid = 50369093
Trg + Lig
Ki
nM
ΔG°
kcal/mole
IC50
nM
Kd
nM
EC50/IC50
nM
koff
s-1
kon
M-1s-1
pHTemp
°C
Adenosine Receptors A2a (A2a)
(Rattus norvegicus (rat))
BDBM50369093
(CHEMBL603389)
Show SMILES CCNC(=O)[C@H]1OC([C@H](O)[C@@H]1O)n1cnc2c(N)nc(nc12)C#Cc1ccncc1 |r|
Show InChI InChI=1S/C19H19N7O4/c1-2-22-18(29)15-13(27)14(28)19(30-15)26-9-23-12-16(20)24-11(25-17(12)26)4-3-10-5-7-21-8-6-10/h5-9,13-15,19,27-28H,2H2,1H3,(H,22,29)(H2,20,24,25)/t13-,14+,15-,19?/m0/s1
Reactome pathway
87n/an/an/an/an/an/an/an/a
University of Virginia
Curated by ChEMBL
Assay Description
Binding affinity towards adenosine A2A receptor in rat brain striatum
J Med Chem 44: 531-9 (2001)
BindingDB Entry DOI: 10.7270/Q20Z740K
Adenosine Receptors A2a (A2a)
(Rattus norvegicus (rat))
BDBM50369093
(CHEMBL603389)
Show SMILES CCNC(=O)[C@H]1OC([C@H](O)[C@@H]1O)n1cnc2c(N)nc(nc12)C#Cc1ccncc1 |r|
Show InChI InChI=1S/C19H19N7O4/c1-2-22-18(29)15-13(27)14(28)19(30-15)26-9-23-12-16(20)24-11(25-17(12)26)4-3-10-5-7-21-8-6-10/h5-9,13-15,19,27-28H,2H2,1H3,(H,22,29)(H2,20,24,25)/t13-,14+,15-,19?/m0/s1
Reactome pathway
87n/an/an/an/an/an/an/an/a
Universit£ di Camerino
Curated by ChEMBL
Assay Description
Binding affinity against adenosine A2a receptor from rat striatum using [3H]-CGS- 21680 as a radioligand.
J Med Chem 38: 1462-72 (1995)
BindingDB Entry DOI: 10.7270/Q2R78FWX
Adenosine receptor A1
(Rattus norvegicus (rat))
BDBM50369093
(CHEMBL603389)
Show SMILES CCNC(=O)[C@H]1OC([C@H](O)[C@@H]1O)n1cnc2c(N)nc(nc12)C#Cc1ccncc1 |r|
Show InChI InChI=1S/C19H19N7O4/c1-2-22-18(29)15-13(27)14(28)19(30-15)26-9-23-12-16(20)24-11(25-17(12)26)4-3-10-5-7-21-8-6-10/h5-9,13-15,19,27-28H,2H2,1H3,(H,22,29)(H2,20,24,25)/t13-,14+,15-,19?/m0/s1
Reactome pathway
428n/an/an/an/an/an/an/an/a
Universit£ di Camerino
Curated by ChEMBL
Assay Description
Binding affinity against adenosine A1 receptor from rat brain using [3H]CHA as a radioligand.
J Med Chem 38: 1462-72 (1995)
BindingDB Entry DOI: 10.7270/Q2R78FWX
Adenosine receptor A1
(Rattus norvegicus (rat))
BDBM50369093
(CHEMBL603389)
Show SMILES CCNC(=O)[C@H]1OC([C@H](O)[C@@H]1O)n1cnc2c(N)nc(nc12)C#Cc1ccncc1 |r|
Show InChI InChI=1S/C19H19N7O4/c1-2-22-18(29)15-13(27)14(28)19(30-15)26-9-23-12-16(20)24-11(25-17(12)26)4-3-10-5-7-21-8-6-10/h5-9,13-15,19,27-28H,2H2,1H3,(H,22,29)(H2,20,24,25)/t13-,14+,15-,19?/m0/s1
Reactome pathway
428n/an/an/an/an/an/an/an/a
University of Virginia
Curated by ChEMBL
Assay Description
Binding affinity towards adenosine A1 receptor in rat brain cortex
J Med Chem 44: 531-9 (2001)
BindingDB Entry DOI: 10.7270/Q20Z740K
Adenosine receptor A1
(Rattus norvegicus (rat))
BDBM50369093
(CHEMBL603389)
Show SMILES CCNC(=O)[C@H]1OC([C@H](O)[C@@H]1O)n1cnc2c(N)nc(nc12)C#Cc1ccncc1 |r|
Show InChI InChI=1S/C19H19N7O4/c1-2-22-18(29)15-13(27)14(28)19(30-15)26-9-23-12-16(20)24-11(25-17(12)26)4-3-10-5-7-21-8-6-10/h5-9,13-15,19,27-28H,2H2,1H3,(H,22,29)(H2,20,24,25)/t13-,14+,15-,19?/m0/s1
Reactome pathway
n/an/an/an/a>1.00E+4n/an/an/an/a
Universit£ di Camerino
Curated by ChEMBL
Assay Description
Functional activity against adenosine A1 receptor from rat atria.
J Med Chem 38: 1462-72 (1995)
BindingDB Entry DOI: 10.7270/Q2R78FWX
Adenosine Receptors A2a (A2a)
(Rattus norvegicus (rat))
BDBM50369093
(CHEMBL603389)
Show SMILES CCNC(=O)[C@H]1OC([C@H](O)[C@@H]1O)n1cnc2c(N)nc(nc12)C#Cc1ccncc1 |r|
Show InChI InChI=1S/C19H19N7O4/c1-2-22-18(29)15-13(27)14(28)19(30-15)26-9-23-12-16(20)24-11(25-17(12)26)4-3-10-5-7-21-8-6-10/h5-9,13-15,19,27-28H,2H2,1H3,(H,22,29)(H2,20,24,25)/t13-,14+,15-,19?/m0/s1
Reactome pathway
n/an/an/an/a>10n/an/an/an/a
Universit£ di Camerino
Curated by ChEMBL
Assay Description
Functional activity against adenosine A2a receptor from rat aorta.
J Med Chem 38: 1462-72 (1995)
BindingDB Entry DOI: 10.7270/Q2R78FWX