BDBM50369164 CHEMBL1169533
SMILES: CC(C)C[C@@H](NC(=O)[C@@H](CC(O)=O)NC(=O)[C@H](CC(=O)N1CCCC1)NC(=O)[C@H](NC(=O)NC1[C@@H](C)CCC[C@H]1C)C(C)C)C(O)=O
InChI Key: InChIKey=REDSVMQELDPLIJ-RRIAGDGJSA-N
Data: 2 IC50
Activity Spreadsheet -- Enzyme Inhibition Constant Data from BindingDB
Found 2 hits for monomerid = 50369164
Trg + Lig
Ki
nM
ΔG°
kcal/mole
IC50
nM
Kd
nM
EC50/IC50
nM
koff
s-1
kon
M-1s-1
pHTemp
°C
RRM1/RRM2 holoenzyme
(Homo sapiens (Human))
BDBM50369164
(CHEMBL1169533)
Show SMILES CC(C)C[C@@H](NC(=O)[C@@H](CC(O)=O)NC(=O)[C@H](CC(=O)N1CCCC1)NC(=O)[C@H](NC(=O)NC1[C@@H](C)CCC[C@H]1C)C(C)C)C(O)=O |r|
Show InChI InChI=1S/C32H54N6O9/c1-17(2)14-23(31(45)46)35-29(43)22(16-25(40)41)33-28(42)21(15-24(39)38-12-7-8-13-38)34-30(44)26(18(3)4)36-32(47)37-27-19(5)10-9-11-20(27)6/h17-23,26-27H,7-16H2,1-6H3,(H,33,42)(H,34,44)(H,35,43)(H,40,41)(H,45,46)(H2,36,37,47)/t19-,20+,21-,22+,23+,26+,27?/m0/s1
Reactome pathway
n/an/a 2n/an/an/an/an/an/a
Bio-M£ga/Boehringer Ingelheim Research Inc.
Curated by ChEMBL
Assay Description
Inhibitory effect was evaluated on Herpes simplex virus (HSV) ribonucleotide reductase (RR) enzyme.
J Med Chem 39: 4173-80 (1996)
Article DOI: 10.1021/jm960324r
BindingDB Entry DOI: 10.7270/Q28W3DZQ
RRM1/RRM2 holoenzyme
(Homo sapiens (Human))
BDBM50369164
(CHEMBL1169533)
Show SMILES CC(C)C[C@@H](NC(=O)[C@@H](CC(O)=O)NC(=O)[C@H](CC(=O)N1CCCC1)NC(=O)[C@H](NC(=O)NC1[C@@H](C)CCC[C@H]1C)C(C)C)C(O)=O |r|
Show InChI InChI=1S/C32H54N6O9/c1-17(2)14-23(31(45)46)35-29(43)22(16-25(40)41)33-28(42)21(15-24(39)38-12-7-8-13-38)34-30(44)26(18(3)4)36-32(47)37-27-19(5)10-9-11-20(27)6/h17-23,26-27H,7-16H2,1-6H3,(H,33,42)(H,34,44)(H,35,43)(H,40,41)(H,45,46)(H2,36,37,47)/t19-,20+,21-,22+,23+,26+,27?/m0/s1
Reactome pathway
n/an/a 55n/an/an/an/an/an/a
Bio-M£ga/Boehringer Ingelheim Research Inc.
Curated by ChEMBL
Assay Description
Inhibitory effect was evaluated on Herpes simplex virus (HSV) ribonucleotide reductase (RR) enzyme.
J Med Chem 39: 4173-80 (1996)
Article DOI: 10.1021/jm960324r
BindingDB Entry DOI: 10.7270/Q28W3DZQ