BDBM50369456 5,6,7,8-TETRAHYDROISOQUINOLINE
SMILES: C1CCc2cnccc2C1
InChI Key: InChIKey=HTMGQIXFZMZZKD-UHFFFAOYSA-N
Data: 1 IC50
Activity Spreadsheet -- Enzyme Inhibition Constant Data from BindingDB
Found 1 hit for monomerid = 50369456
Trg + Lig
Ki
nM
ΔG°
kcal/mole
IC50
nM
Kd
nM
EC50/IC50
nM
koff
s-1
kon
M-1s-1
pHTemp
°C
Sigma non-opioid intracellular receptor 1
(Homo sapiens (Human))
BDBM50369456
(5,6,7,8-TETRAHYDROISOQUINOLINE)
Show SMILES C1CCc2cnccc2C1
Show InChI InChI=1S/C9H11N/c1-2-4-9-7-10-6-5-8(9)3-1/h5-7H,1-4H2
n/an/a 56n/an/an/an/an/an/a
Torrey Pines Institute for Molecular Studies
Curated by ChEMBL
Assay Description
Inhibitory activity towards Sigma opioid receptor type 1
J Med Chem 42: 3743-78 (1999)
BindingDB Entry DOI: 10.7270/Q22Z167W