BDBM50370221 CHEMBL610855
SMILES: Nc1nc2c(N)ncnc2n1C1O[C@H](COP(O)(=O)O[C@@H]2[C@H](O)[C@@H](COP(O)(=O)O[C@@H]3[C@H](O)[C@@H](COP(O)(=O)O[C@@H]4[C@H](O)[C@@H](COP(O)(O)=O)OC4n4c(N)nc5c(N)ncnc45)OC3n3c(N)nc4c(N)ncnc34)OC2n2c(N)nc3c(N)ncnc23)[C@@H](O)[C@H]1O
InChI Key: InChIKey=VESGXLGTCAYMQV-XQUJPFHHSA-N
Data: 1 IC50
Activity Spreadsheet -- Enzyme Inhibition Constant Data from BindingDB
Found 1 hit for monomerid = 50370221
Trg + Lig
Ki
nM
ΔG°
kcal/mole
IC50
nM
Kd
nM
EC50/IC50
nM
koff
s-1
kon
M-1s-1
pHTemp
°C
RNase L
(Mus musculus)
BDBM50370221
(CHEMBL610855)
Show SMILES Nc1nc2c(N)ncnc2n1C1O[C@H](COP(O)(=O)O[C@@H]2[C@H](O)[C@@H](COP(O)(=O)O[C@@H]3[C@H](O)[C@@H](COP(O)(=O)O[C@@H]4[C@H](O)[C@@H](COP(O)(O)=O)OC4n4c(N)nc5c(N)ncnc45)OC3n3c(N)nc4c(N)ncnc34)OC2n2c(N)nc3c(N)ncnc23)[C@@H](O)[C@H]1O |r|
Show InChI InChI=1S/C40H54N24O25P4/c41-25-13-29(53-5-49-25)61(37(45)57-13)33-21(69)17(65)9(83-33)2-80-91(73,74)88-23-19(67)11(85-35(23)63-31-15(59-39(63)47)27(43)51-7-55-31)4-82-93(77,78)89-24-20(68)12(86-36(24)64-32-16(60-40(64)48)28(44)52-8-56-32)3-81-92(75,76)87-22-18(66)10(1-79-90(70,71)72)84-34(22)62-30-14(58-38(62)46)26(42)50-6-54-30/h5-12,17-24,33-36,65-69H,1-4H2,(H2,45,57)(H2,46,58)(H2,47,59)(H2,48,60)(H,73,74)(H,75,76)(H,77,78)(H2,41,49,53)(H2,42,50,54)(H2,43,51,55)(H2,44,52,56)(H2,70,71,72)/t9-,10-,11-,12-,17-,18-,19-,20-,21-,22-,23-,24-,33?,34?,35?,36?/m1/s1
n/an/a 500n/an/an/an/an/an/a
Gunma University
Curated by ChEMBL
Assay Description
Displacement of [125I]-labeled 2-5A from 2-5A dependent Ribonuclease L (RNase L) of mouse liver
J Med Chem 46: 4926-32 (2003)
Article DOI: 10.1021/jm030035k
BindingDB Entry DOI: 10.7270/Q2QR4XVM