BDBM50370223 CHEMBL607888
SMILES: Nc1nc2c(N)ncnc2n1C1O[C@H](COP(O)(=O)O[C@@H]2[C@H](O)[C@@H](CO)OC2n2c(N)nc3c(N)ncnc23)[C@@H](O)[C@H]1O
InChI Key: InChIKey=CLDAZTJARDTMGL-IXVYOMHZSA-N
Data: 1 IC50
Activity Spreadsheet -- Enzyme Inhibition Constant Data from BindingDB
Found 1 hit for monomerid = 50370223
Trg + Lig
Ki
nM
ΔG°
kcal/mole
IC50
nM
Kd
nM
EC50/IC50
nM
koff
s-1
kon
M-1s-1
pHTemp
°C
RNase L
(Mus musculus)
BDBM50370223
(CHEMBL607888)
Show SMILES Nc1nc2c(N)ncnc2n1C1O[C@H](COP(O)(=O)O[C@@H]2[C@H](O)[C@@H](CO)OC2n2c(N)nc3c(N)ncnc23)[C@@H](O)[C@H]1O |r|
Show InChI InChI=1S/C20H27N12O10P/c21-13-7-15(27-3-25-13)31(19(23)29-7)17-11(36)9(34)6(41-17)2-39-43(37,38)42-12-10(35)5(1-33)40-18(12)32-16-8(30-20(32)24)14(22)26-4-28-16/h3-6,9-12,17-18,33-36H,1-2H2,(H2,23,29)(H2,24,30)(H,37,38)(H2,21,25,27)(H2,22,26,28)/t5-,6-,9-,10-,11-,12-,17?,18?/m1/s1
n/an/a>1.00E+5n/an/an/an/an/an/a
Gunma University
Curated by ChEMBL
Assay Description
Displacement of [125I]-labeled 2-5A from 2-5A dependent Ribonuclease L (RNase L) of mouse liver
J Med Chem 46: 4926-32 (2003)
Article DOI: 10.1021/jm030035k
BindingDB Entry DOI: 10.7270/Q2QR4XVM