BDBM50370314 CHEMBL1907956
SMILES: CCCCC\C=C/C\C=C/C\C=C/C\C=C/CCCC(=O)O[C@H](C)c1ccco1
InChI Key: InChIKey=FWFWHUDKQSGFOX-RASWKYMMSA-N
Data: 3 KI  1 IC50
Activity Spreadsheet -- Enzyme Inhibition Constant Data from BindingDB
Found 4 hits for monomerid = 50370314
Trg + Lig
Ki
nM
ΔG°
kcal/mole
IC50
nM
Kd
nM
EC50/IC50
nM
koff
s-1
kon
M-1s-1
pHTemp
°C
Cannabinoid receptor 1
(Rattus norvegicus (rat))
BDBM50370314
(CHEMBL1907956)
Show SMILES CCCCC\C=C/C\C=C/C\C=C/C\C=C/CCCC(=O)O[C@H](C)c1ccco1 |r|
Show InChI InChI=1S/C26H38O3/c1-3-4-5-6-7-8-9-10-11-12-13-14-15-16-17-18-19-22-26(27)29-24(2)25-21-20-23-28-25/h7-8,10-11,13-14,16-17,20-21,23-24H,3-6,9,12,15,18-19,22H2,1-2H3/b8-7-,11-10-,14-13-,17-16-/t24-/m1/s1
Reactome pathway
>1.00E+3n/an/an/an/an/an/an/an/a
Universidad Complutense
Curated by ChEMBL
Assay Description
Binding affinity against G protein coupled Cannabinoid receptor 1 using [3H]WIN-55212-2 in rat cerebellum membranes
J Med Chem 46: 1512-22 (2003)
Article DOI: 10.1021/jm0210818
BindingDB Entry DOI: 10.7270/Q2GQ6ZHS
Cannabinoid receptor 2
(Homo sapiens (Human))
BDBM50370314
(CHEMBL1907956)
Show SMILES CCCCC\C=C/C\C=C/C\C=C/C\C=C/CCCC(=O)O[C@H](C)c1ccco1 |r|
Show InChI InChI=1S/C26H38O3/c1-3-4-5-6-7-8-9-10-11-12-13-14-15-16-17-18-19-22-26(27)29-24(2)25-21-20-23-28-25/h7-8,10-11,13-14,16-17,20-21,23-24H,3-6,9,12,15,18-19,22H2,1-2H3/b8-7-,11-10-,14-13-,17-16-/t24-/m1/s1
Reactome pathway
>5.00E+3n/an/an/an/an/an/an/an/a
Universidad Complutense
Curated by ChEMBL
Assay Description
Binding affinity against G protein coupled human Cannabinoid receptor 2 using [3H]CP-55940 in HEK293 EBNA transfected cells
J Med Chem 46: 1512-22 (2003)
Article DOI: 10.1021/jm0210818
BindingDB Entry DOI: 10.7270/Q2GQ6ZHS
Vanilloid receptor
(Rattus norvegicus (rat))
BDBM50370314
(CHEMBL1907956)
Show SMILES CCCCC\C=C/C\C=C/C\C=C/C\C=C/CCCC(=O)O[C@H](C)c1ccco1 |r|
Show InChI InChI=1S/C26H38O3/c1-3-4-5-6-7-8-9-10-11-12-13-14-15-16-17-18-19-22-26(27)29-24(2)25-21-20-23-28-25/h7-8,10-11,13-14,16-17,20-21,23-24H,3-6,9,12,15,18-19,22H2,1-2H3/b8-7-,11-10-,14-13-,17-16-/t24-/m1/s1
Reactome pathway
>5.00E+3n/an/an/an/an/an/an/an/a
Universidad Complutense
Curated by ChEMBL
Assay Description
Binding affinity against vanilloid receptor 1 (VR1) using [3H]RTX in rat spinal cord membranes
J Med Chem 46: 1512-22 (2003)
Article DOI: 10.1021/jm0210818
BindingDB Entry DOI: 10.7270/Q2GQ6ZHS
Fatty-acid amide hydrolase 1 (aa 30-579)
(Rattus norvegicus (rat))
BDBM50370314
(CHEMBL1907956)
Show SMILES CCCCC\C=C/C\C=C/C\C=C/C\C=C/CCCC(=O)O[C@H](C)c1ccco1 |r|
Show InChI InChI=1S/C26H38O3/c1-3-4-5-6-7-8-9-10-11-12-13-14-15-16-17-18-19-22-26(27)29-24(2)25-21-20-23-28-25/h7-8,10-11,13-14,16-17,20-21,23-24H,3-6,9,12,15,18-19,22H2,1-2H3/b8-7-,11-10-,14-13-,17-16-/t24-/m1/s1
n/an/a>1.20E+5n/an/an/an/an/an/a
Universidad Complutense
Curated by ChEMBL
Assay Description
Inhibition of fatty acid amide hydrolase (FAAH) was determined using rat brain homogenates as the enzyme source and [3H]anandamide as substrate
J Med Chem 46: 1512-22 (2003)
Article DOI: 10.1021/jm0210818
BindingDB Entry DOI: 10.7270/Q2GQ6ZHS