BDBM50370611 CHEMBL610518
SMILES: N[C@@H](CC(O)=O)C(=O)OC[C@H]1OC([C@H](O)[C@@H]1O)n1c(Br)nc2cc(Cl)c(Cl)cc12
InChI Key: InChIKey=GXVAFYZAAWUUHH-RUUQHNQISA-N
Data: 1 IC50
Activity Spreadsheet -- Enzyme Inhibition Constant Data from BindingDB
Found 1 hit for monomerid = 50370611
Trg + Lig
Ki
nM
ΔG°
kcal/mole
IC50
nM
Kd
nM
EC50/IC50
nM
koff
s-1
kon
M-1s-1
pHTemp
°C
Oligopeptide transporter small intestine isoform
(Homo sapiens (Human))
BDBM50370611
(CHEMBL610518)
Show SMILES N[C@@H](CC(O)=O)C(=O)OC[C@H]1OC([C@H](O)[C@@H]1O)n1c(Br)nc2cc(Cl)c(Cl)cc12 |r|
Show InChI InChI=1S/C16H16BrCl2N3O7/c17-16-21-8-1-5(18)6(19)2-9(8)22(16)14-13(26)12(25)10(29-14)4-28-15(27)7(20)3-11(23)24/h1-2,7,10,12-14,25-26H,3-4,20H2,(H,23,24)/t7-,10+,12+,13+,14?/m0/s1
Reactome pathway
n/an/a 2.60E+5n/an/an/an/an/an/a
University of Michigan
Curated by ChEMBL
Assay Description
Inhibitory concentration against [3H]glycylsarcosine uptake in HeLa cells expressing human Intestinal peptide transporter PepT1
J Med Chem 48: 1274-7 (2005)
Article DOI: 10.1021/jm049450i
BindingDB Entry DOI: 10.7270/Q2348M46