BDBM50370612 CHEMBL608238
SMILES: N[C@@H](Cc1ccccc1)C(=O)OC[C@H]1OC([C@H](O)[C@@H]1O)n1c(Br)nc2cc(Cl)c(Cl)cc12
InChI Key: InChIKey=RXFVXQPXNUGRRD-PFGKVRNLSA-N
Data: 1 IC50
Activity Spreadsheet -- Enzyme Inhibition Constant Data from BindingDB
Found 1 hit for monomerid = 50370612
Trg + Lig
Ki
nM
ΔG°
kcal/mole
IC50
nM
Kd
nM
EC50/IC50
nM
koff
s-1
kon
M-1s-1
pHTemp
°C
Oligopeptide transporter small intestine isoform
(Homo sapiens (Human))
BDBM50370612
(CHEMBL608238)
Show SMILES N[C@@H](Cc1ccccc1)C(=O)OC[C@H]1OC([C@H](O)[C@@H]1O)n1c(Br)nc2cc(Cl)c(Cl)cc12 |r|
Show InChI InChI=1S/C21H20BrCl2N3O5/c22-21-26-14-7-11(23)12(24)8-15(14)27(21)19-18(29)17(28)16(32-19)9-31-20(30)13(25)6-10-4-2-1-3-5-10/h1-5,7-8,13,16-19,28-29H,6,9,25H2/t13-,16+,17+,18+,19?/m0/s1
Reactome pathway
n/an/a 2.18E+5n/an/an/an/an/an/a
University of Michigan
Curated by ChEMBL
Assay Description
Inhibitory concentration against [3H]glycylsarcosine uptake in HeLa cells expressing human Intestinal peptide transporter PepT1
J Med Chem 48: 1274-7 (2005)
Article DOI: 10.1021/jm049450i
BindingDB Entry DOI: 10.7270/Q2348M46