BDBM50370860 CHEMBL219268
SMILES: NNC(=O)CNC(=O)c1ccccc1C(F)(F)F
InChI Key: InChIKey=WUBIJSKYXHYREU-UHFFFAOYSA-N
Data: 1 IC50
Activity Spreadsheet -- Enzyme Inhibition Constant Data from BindingDB
Found 1 hit for monomerid = 50370860
Trg + Lig
Ki
nM
ΔG°
kcal/mole
IC50
nM
Kd
nM
EC50/IC50
nM
koff
s-1
kon
M-1s-1
pHTemp
°C
Cystathionine beta-lyase metC
(Escherichia coli K-12)
BDBM50370860
(CHEMBL219268)
Show SMILES NNC(=O)CNC(=O)c1ccccc1C(F)(F)F
Show InChI InChI=1S/C10H10F3N3O2/c11-10(12,13)7-4-2-1-3-6(7)9(18)15-5-8(17)16-14/h1-4H,5,14H2,(H,15,18)(H,16,17)
n/an/a 79n/an/an/an/an/an/a
McMaster University
Curated by ChEMBL
Assay Description
Inhibition of Escherichia coli CBL
J Med Chem 50: 755-64 (2007)
Article DOI: 10.1021/jm061132r
BindingDB Entry DOI: 10.7270/Q2KS6SCJ