BDBM50371143 CHEMBL244625
SMILES: [#6]-[#7](-[#6])-c1ccc(-[#6]=[#7]\[#7]=[#6](\[#7])-[#7])cc1
InChI Key: InChIKey=KGSVTIOPRMVDLA-UHFFFAOYSA-N
Data: 1 Kd
Activity Spreadsheet -- Enzyme Inhibition Constant Data from BindingDB
Found 1 hit for monomerid = 50371143
Trg + Lig
Ki
nM
ΔG°
kcal/mole
IC50
nM
Kd
nM
EC50/IC50
nM
koff
s-1
kon
M-1s-1
pHTemp
°C
Iron-starvation protein PigA
(Pseudomonas aeruginosa)
BDBM50371143
(CHEMBL244625)
Show SMILES [#6]-[#7](-[#6])-c1ccc(-[#6]=[#7]\[#7]=[#6](\[#7])-[#7])cc1 |w:7.6|
Show InChI InChI=1S/C10H15N5/c1-15(2)9-5-3-8(4-6-9)7-13-14-10(11)12/h3-7H,1-2H3,(H4,11,12,14)
n/an/an/a 3.00E+4n/an/an/an/an/a
University of Maryland
Curated by ChEMBL
Assay Description
Binding affinity to Pseudomonas aeruginosa heme oxygenase
J Med Chem 50: 3804-13 (2007)
Article DOI: 10.1021/jm0700969
BindingDB Entry DOI: 10.7270/Q2PZ59NM