BDBM50371216 CHEMBL554252
SMILES: CC[N+](C)(CC)CCCC(=O)Nc1ccc-2c(c1)C(=O)c1cccc3ccnc-2c13
InChI Key: InChIKey=LGSWRVWDOXHDMF-UHFFFAOYSA-O
Data: 2 IC50
Activity Spreadsheet -- Enzyme Inhibition Constant Data from BindingDB
Found 2 hits for monomerid = 50371216
Trg + Lig
Ki
nM
ΔG°
kcal/mole
IC50
nM
Kd
nM
EC50/IC50
nM
koff
s-1
kon
M-1s-1
pHTemp
°C
Acetylcholinesterase
(Electrophorus electricus (Electric eel))
BDBM50371216
(CHEMBL554252)
Show SMILES CC[N+](C)(CC)CCCC(=O)Nc1ccc-2c(c1)C(=O)c1cccc3ccnc-2c13
Show InChI InChI=1S/C25H27N3O2/c1-4-28(3,5-2)15-7-10-22(29)27-18-11-12-19-21(16-18)25(30)20-9-6-8-17-13-14-26-24(19)23(17)20/h6,8-9,11-14,16H,4-5,7,10,15H2,1-3H3/p+1
n/an/a 2.62n/an/an/an/an/an/a
Sun Yat-Sen University
Curated by ChEMBL
Assay Description
Inhibition of electric eel AChE
Bioorg Med Chem Lett 17: 3765-8 (2007)
Article DOI: 10.1016/j.bmcl.2007.04.015
BindingDB Entry DOI: 10.7270/Q28C9X2C
Butyrylcholinesterase (BChE)
(Equus caballus (Horse))
BDBM50371216
(CHEMBL554252)
Show SMILES CC[N+](C)(CC)CCCC(=O)Nc1ccc-2c(c1)C(=O)c1cccc3ccnc-2c13
Show InChI InChI=1S/C25H27N3O2/c1-4-28(3,5-2)15-7-10-22(29)27-18-11-12-19-21(16-18)25(30)20-9-6-8-17-13-14-26-24(19)23(17)20/h6,8-9,11-14,16H,4-5,7,10,15H2,1-3H3/p+1
n/an/a 5.19E+3n/an/an/an/an/an/a
Sun Yat-Sen University
Curated by ChEMBL
Assay Description
Inhibition of equine serum BuChE
Bioorg Med Chem Lett 17: 3765-8 (2007)
Article DOI: 10.1016/j.bmcl.2007.04.015
BindingDB Entry DOI: 10.7270/Q28C9X2C