BDBM50371240 CHEMBL400355
SMILES: Clc1ccc(cc1)-c1ccc(o1)C(=O)Nc1ccc2cc[nH]c2c1
InChI Key: InChIKey=OVESJEVEMVKRJZ-UHFFFAOYSA-N
Data: 1 IC50
Activity Spreadsheet -- Enzyme Inhibition Constant Data from BindingDB
Found 1 hit for monomerid = 50371240
Trg + Lig
Ki
nM
ΔG°
kcal/mole
IC50
nM
Kd
nM
EC50/IC50
nM
koff
s-1
kon
M-1s-1
pHTemp
°C
Sodium channel protein type X alpha subunit
(Mus musculus)
BDBM50371240
(CHEMBL400355)
Show SMILES Clc1ccc(cc1)-c1ccc(o1)C(=O)Nc1ccc2cc[nH]c2c1
Show InChI InChI=1S/C19H13ClN2O2/c20-14-4-1-13(2-5-14)17-7-8-18(24-17)19(23)22-15-6-3-12-9-10-21-16(12)11-15/h1-11,21H,(H,22,23)
n/an/a 3.10E+3n/an/an/an/an/an/a
Abbott Laboratories
Curated by ChEMBL
Assay Description
Inhibition of mouse recombinant Nav 1.8 channel expressed in HEK293 cells by isotopic efflux assay
J Med Chem 51: 407-16 (2008)
Article DOI: 10.1021/jm070637u
BindingDB Entry DOI: 10.7270/Q2KK9CN7